{"text_format":"1","workbook":"xlsx","n_sheets":12,"sheets":["Updates","Breakpoint Overview","Summary","BIT-1","BIT-1 Precision","BIT-2","BIT-2 Precision","BIT-3","BIT-3 Precision","BIT-4","BIT-4 Precision","list"],"not_rendered":{"charts":0,"images":1,"macros":1,"external_links":3,"defined_names":85,"comments":0,"pivot_tables":0},"unopened":[],"bounds":{"document_bytes":16777216,"sheet_cells":100000,"rows_first":2000,"rows_last":500,"rows_between":2000,"halvings":0,"cell_chars":16384,"cell_head_chars":4096},"cells_cut":0,"cells_raw":0,"read":"whole","date_system":"1900"}

{"sheet":"Updates","index":0,"n_rows":3,"n_cols":4,"rows_kept":3,"cut":false,"hidden":false,"merged":[]}
["Update Number","Date Updated","Tab","Reason"]
[1.1000000000000001,"2023-10-17","BIT-2","AR0038's organism was mislabelled as Klebsiella pneumoniae and should be Enterobacter cloacae."]
[2,"2023-12-01","All Precision tabs","XLOOKUP functions are not available in Excel versions older than O365 (eg, Excel 2016, 2019); this function combines and replaces VLOOKUP and HLOOKUP into one function. XLOOKUP was used in columns I and hidden columns N-P. In older versions of Excel, \"XLOOKUP\" is not recognized and gives a #NAME? error in columns I-L. The formulas in columns I, N,O, and P were revised to use the VLOOKUP formula, which is compatable with Excel older than O365. This version is also compatable with O365.  https://support.microsoft.com/en-au/office/xlookup-function-b7fd680e-6d10-43e6-84f9-88eae8bf5929"]

{"sheet":"Breakpoint Overview","index":1,"n_rows":33,"n_cols":4,"rows_kept":33,"cut":false,"hidden":false,"merged":[]}
[]
["Antimicrobial","Reporting Group","2023 CLSI Breakpoint (S/I or SDD/R)","Panel"]
["Aztreonam","Enterobacterales","4/8/16","BIT-1"]
["Cefazolin","Enterobacterales","2/4/8","BIT-1"]
["Cefepime","Enterobacterales","2/4-8/16","BIT-1"]
["Cefotaxime","Enterobacterales","1/2/4","BIT-1"]
["Ceftazidime","Enterobacterales","4/8/16","BIT-1"]
["Ceftriaxone","Enterobacterales","1/2/4","BIT-1"]
["Ciprofloxacin","Enterobacterales","0.25/0.5/1","BIT-1"]
["Ertapenem","Enterobacterales","0.5/1/2","BIT-1"]
["Imipenem","Enterobacterales","1/2/4","BIT-1"]
["Levofloxacin","Enterobacterales","0.5/1/2","BIT-1"]
["Meropenem","Enterobacterales","1/2/4","BIT-1"]
["Amikacin","Enterobacterales","4/8/16","BIT-2"]
["Gentamicin","Enterobacterales","2/4/8","BIT-2"]
["Piperacillin/tazobactam","Enterobacterales","8/16/32","BIT-2"]
["Tobramycin","Enterobacterales","2/4/8","BIT-2"]
["Colistin","Enterobacterales","2/4","BIT-2"]
["Aztreonam","Pseudomonas aeruginosa","8/16/32","BIT-3"]
["Cefepime","Pseudomonas aeruginosa","8/16/32","BIT-3"]
["Ceftazidime","Pseudomonas aeruginosa","8/16/32","BIT-3"]
["Ciprofloxacin","Pseudomonas aeruginosa","0.5/1/2","BIT-3"]
["Imipenem","Pseudomonas aeruginosa","2/4/8","BIT-3"]
["Levofloxacin","Pseudomonas aeruginosa","1/2/4","BIT-3"]
["Meropenem","Pseudomonas aeruginosa","2/4/8","BIT-3"]
["Piperacillin/tazobactam","Pseudomonas aeruginosa","16/32/64","BIT-3"]
["Tobramycin","Pseudomonas aeruginosa","1/2/4","BIT-3"]
["Colistin"," Pseudomonas aeruginosa","2/4","BIT-3"]
["Colistin","Acinetobacter baumannii","2/4","BIT-4"]
["Imipenem","Acinetobacter baumannii","2/4/8","BIT-4"]
["Meropenem","Acinetobacter baumannii","2/4/8","BIT-4"]
["CLSI Version 1.0. This was last updated on 15 May 2023 and has been approved by CLSI’s Outreach\nWorking Group."]
["This is Part F. of the 2023 Breakpoint Implementation Toolkit. To access the entire BIT Toolkit, visit https://clsi.org/bit-toolkit/."]

{"sheet":"Summary","index":2,"n_rows":42,"n_cols":20,"rows_kept":42,"cut":false,"hidden":false,"merged":[[1,19,2,19],[1,18,2,18],[1,17,2,17],[0,6,0,14],[0,0,2,0],[0,1,2,1],[0,2,2,2],[0,3,2,3],[0,4,2,4],[0,5,2,5],[1,6,2,6],[1,8,2,8],[1,9,2,9],[1,7,2,7]]}
["Set","Reporting Group","Antimicrobial","N","N 'S'","N 'R'","Accuracy: Agreement and Errors",null,null,null,null,null,null,null,null,null,null,"Precision/Reproducibility"]
[null,null,null,null,null,null,"% EA","N EA","% CA","N CA","Errors",null,null,null,null,null,null,"N","% Equivalent","N Equivalent"]
[null,null,null,null,null,null,null,null,null,null,"%Minor ","N Minor","%Major","N Major","% Very Major","N Very Major"]
["BIT-1","Enterobacterales","Aztreonam",{"$f":"'BIT-1'!BU42","v":0},{"$f":"'BIT-1'!BU45","v":0},{"$f":"'BIT-1'!BU46","v":0},{"$f":"'BIT-1'!BR42","v":""},{"$f":"'BIT-1'!$BS42","v":0},{"$f":"'BIT-1'!BR43","v":""},{"$f":"'BIT-1'!$BS43","v":0},{"$f":"'BIT-1'!BR44","v":""},{"$f":"'BIT-1'!$BS44","v":0},{"$f":"'BIT-1'!BR45","v":""},{"$f":"'BIT-1'!$BS45","v":0},{"$f":"'BIT-1'!BR46","v":""},{"$f":"'BIT-1'!$BS46","v":0},null,{"$f":"'BIT-1 Precision'!U6","v":0},{"$f":"'BIT-1 Precision'!T6","v":""},{"$f":"'BIT-1 Precision'!S6","v":0}]
["BIT-1","Enterobacterales","Cefazolin",{"$f":"'BIT-1'!BF42","v":0},{"$f":"'BIT-1'!BF45","v":0},{"$f":"'BIT-1'!BF46","v":0},{"$f":"'BIT-1'!BC42","v":""},{"$f":"'BIT-1'!$BD42","v":0},{"$f":"'BIT-1'!BC43","v":""},{"$f":"'BIT-1'!$BD43","v":0},{"$f":"'BIT-1'!BC44","v":""},{"$f":"'BIT-1'!$BD44","v":0},{"$f":"'BIT-1'!BC45","v":""},{"$f":"'BIT-1'!$BD45","v":0},{"$f":"'BIT-1'!BC46","v":""},{"$f":"'BIT-1'!$BD46","v":0},null,{"$f":"'BIT-1 Precision'!U16","v":0},{"$f":"'BIT-1 Precision'!T16","v":""},{"$f":"'BIT-1 Precision'!S16","v":0}]
["BIT-1","Enterobacterales","Cefepime",{"$f":"'BIT-1'!CJ42","v":0},{"$f":"'BIT-1'!CJ45","v":0},{"$f":"'BIT-1'!CJ46","v":0},{"$f":"'BIT-1'!CG42","v":""},{"$f":"'BIT-1'!$CH42","v":0},{"$f":"'BIT-1'!CG43","v":""},{"$f":"'BIT-1'!$CH43","v":0},{"$f":"'BIT-1'!CG44","v":""},{"$f":"'BIT-1'!$CH44","v":0},{"$f":"'BIT-1'!CG45","v":""},{"$f":"'BIT-1'!$CH45","v":0},{"$f":"'BIT-1'!CG46","v":""},{"$f":"'BIT-1'!$CH46","v":0},null,{"$f":"'BIT-1 Precision'!U26","v":0},{"$f":"'BIT-1 Precision'!T26","v":""},{"$f":"'BIT-1 Precision'!S26","v":0}]
["BIT-1","Enterobacterales","Cefotaxime",{"$f":"'BIT-1'!DN42","v":0},{"$f":"'BIT-1'!DN45","v":0},{"$f":"'BIT-1'!DN46","v":0},{"$f":"'BIT-1'!DK42","v":""},{"$f":"'BIT-1'!$DL42","v":0},{"$f":"'BIT-1'!DK43","v":""},{"$f":"'BIT-1'!$DL43","v":0},{"$f":"'BIT-1'!DK44","v":""},{"$f":"'BIT-1'!$DL44","v":0},{"$f":"'BIT-1'!DK45","v":""},{"$f":"'BIT-1'!$DL45","v":0},{"$f":"'BIT-1'!DK46","v":""},{"$f":"'BIT-1'!$DL46","v":0},null,{"$f":"'BIT-1 Precision'!U36","v":0},{"$f":"'BIT-1 Precision'!T36","v":""},{"$f":"'BIT-1 Precision'!S36","v":0}]
["BIT-1","Enterobacterales","Ceftazidime",{"$f":"'BIT-1'!CY42","v":0},{"$f":"'BIT-1'!CY45","v":0},{"$f":"'BIT-1'!CY46","v":0},{"$f":"'BIT-1'!CV42","v":""},{"$f":"'BIT-1'!$CW42","v":0},{"$f":"'BIT-1'!CV43","v":""},{"$f":"'BIT-1'!$CW43","v":0},{"$f":"'BIT-1'!CV44","v":""},{"$f":"'BIT-1'!$CW44","v":0},{"$f":"'BIT-1'!CV45","v":""},{"$f":"'BIT-1'!$CW45","v":0},{"$f":"'BIT-1'!CV46","v":""},{"$f":"'BIT-1'!$CW46","v":0},null,{"$f":"'BIT-1 Precision'!U46","v":0},{"$f":"'BIT-1 Precision'!T46","v":""},{"$f":"'BIT-1 Precision'!S46","v":0}]
["BIT-1","Enterobacterales","Ceftriaxone",{"$f":"'BIT-1'!EC42","v":0},{"$f":"'BIT-1'!EC45","v":0},{"$f":"'BIT-1'!EC46","v":0},{"$f":"'BIT-1'!DZ42","v":""},{"$f":"'BIT-1'!$EA42","v":0},{"$f":"'BIT-1'!DZ43","v":""},{"$f":"'BIT-1'!$EA43","v":0},{"$f":"'BIT-1'!DZ44","v":""},{"$f":"'BIT-1'!$EA44","v":0},{"$f":"'BIT-1'!DZ45","v":""},{"$f":"'BIT-1'!$EA45","v":0},{"$f":"'BIT-1'!DZ46","v":""},{"$f":"'BIT-1'!$EA46","v":0},null,{"$f":"'BIT-1 Precision'!U56","v":0},{"$f":"'BIT-1 Precision'!T56","v":""},{"$f":"'BIT-1 Precision'!S56","v":0}]
["BIT-1","Enterobacterales","Ciprofloxacin",{"$f":"'BIT-1'!ER42","v":0},{"$f":"'BIT-1'!ER45","v":0},{"$f":"'BIT-1'!ER46","v":0},{"$f":"'BIT-1'!EO42","v":""},{"$f":"'BIT-1'!$EP42","v":0},{"$f":"'BIT-1'!EO43","v":""},{"$f":"'BIT-1'!$EP43","v":0},{"$f":"'BIT-1'!EO44","v":""},{"$f":"'BIT-1'!$EP44","v":0},{"$f":"'BIT-1'!EO45","v":""},{"$f":"'BIT-1'!$EP45","v":0},{"$f":"'BIT-1'!EO46","v":""},{"$f":"'BIT-1'!$EP46","v":0},null,{"$f":"'BIT-1 Precision'!U66","v":0},{"$f":"'BIT-1 Precision'!T66","v":""},{"$f":"'BIT-1 Precision'!S66","v":0}]
["BIT-1","Enterobacterales","Ertapenem",{"$f":"'BIT-1'!M42","v":0},{"$f":"'BIT-1'!M45","v":0},{"$f":"'BIT-1'!M46","v":0},{"$f":"'BIT-1'!J42","v":""},{"$f":"'BIT-1'!$K42","v":0},{"$f":"'BIT-1'!J43","v":""},{"$f":"'BIT-1'!$K43","v":0},{"$f":"'BIT-1'!J44","v":""},{"$f":"'BIT-1'!$K44","v":0},{"$f":"'BIT-1'!J45","v":""},{"$f":"'BIT-1'!$K45","v":0},{"$f":"'BIT-1'!J46","v":""},{"$f":"'BIT-1'!$K46","v":0},null,{"$f":"'BIT-1 Precision'!U76","v":0},{"$f":"'BIT-1 Precision'!T76","v":""},{"$f":"'BIT-1 Precision'!S76","v":0}]
["BIT-1","Enterobacterales","Imipenem",{"$f":"'BIT-1'!AQ42","v":0},{"$f":"'BIT-1'!AQ45","v":0},{"$f":"'BIT-1'!AQ46","v":0},{"$f":"'BIT-1'!AN42","v":""},{"$f":"'BIT-1'!$AO42","v":0},{"$f":"'BIT-1'!AN43","v":""},{"$f":"'BIT-1'!$AO43","v":0},{"$f":"'BIT-1'!AN44","v":""},{"$f":"'BIT-1'!$AO44","v":0},{"$f":"'BIT-1'!AN45","v":""},{"$f":"'BIT-1'!$AO45","v":0},{"$f":"'BIT-1'!AN46","v":""},{"$f":"'BIT-1'!$AO46","v":0},null,{"$f":"'BIT-1 Precision'!U86","v":0},{"$f":"'BIT-1 Precision'!T86","v":""},{"$f":"'BIT-1 Precision'!S86","v":0}]
["BIT-1","Enterobacterales","Levofloxacin",{"$f":"'BIT-1'!FG42","v":0},{"$f":"'BIT-1'!FG45","v":0},{"$f":"'BIT-1'!FG46","v":0},{"$f":"'BIT-1'!FD42","v":""},{"$f":"'BIT-1'!$FE42","v":0},{"$f":"'BIT-1'!FD43","v":""},{"$f":"'BIT-1'!$FE43","v":0},{"$f":"'BIT-1'!FD44","v":""},{"$f":"'BIT-1'!$FE44","v":0},{"$f":"'BIT-1'!FD45","v":""},{"$f":"'BIT-1'!$FE45","v":0},{"$f":"'BIT-1'!FD46","v":""},{"$f":"'BIT-1'!$FE46","v":0},null,{"$f":"'BIT-1 Precision'!U96","v":0},{"$f":"'BIT-1 Precision'!T96","v":""},{"$f":"'BIT-1 Precision'!S96","v":0}]
["BIT-1","Enterobacterales","Meropenem",{"$f":"'BIT-1'!AB42","v":0},{"$f":"'BIT-1'!AB45","v":0},{"$f":"'BIT-1'!AB46","v":0},{"$f":"'BIT-1'!Y42","v":""},{"$f":"'BIT-1'!$Z42","v":0},{"$f":"'BIT-1'!Y43","v":""},{"$f":"'BIT-1'!$Z43","v":0},{"$f":"'BIT-1'!Y44","v":""},{"$f":"'BIT-1'!$Z44","v":0},{"$f":"'BIT-1'!Y45","v":""},{"$f":"'BIT-1'!$Z45","v":0},{"$f":"'BIT-1'!Y46","v":""},{"$f":"'BIT-1'!$Z46","v":0},null,{"$f":"'BIT-1 Precision'!U106","v":0},{"$f":"'BIT-1 Precision'!T106","v":""},{"$f":"'BIT-1 Precision'!S106","v":0}]
["BIT-2","Enterobacterales","Amikacin",{"$f":"'BIT-2'!BF44","v":0},{"$f":"'BIT-2'!BF47","v":0},{"$f":"'BIT-2'!BF48","v":0},{"$f":"'BIT-2'!BC44","v":""},{"$f":"'BIT-2'!BD44","v":0},{"$f":"'BIT-2'!BC45","v":""},{"$f":"'BIT-2'!BF45","v":0},{"$f":"'BIT-2'!BC46","v":""},{"$f":"'BIT-2'!BH46","v":0},{"$f":"'BIT-2'!BC47","v":""},{"$f":"'BIT-2'!BJ47","v":0},{"$f":"'BIT-2'!BC48","v":""},{"$f":"'BIT-2'!BD48","v":0},null,{"$f":"'BIT-2 Precision'!U6","v":0},{"$f":"'BIT-2 Precision'!T6","v":""},{"$f":"'BIT-2 Precision'!S6","v":0}]
["BIT-2","Enterobacterales","Colistin",{"$f":"'BIT-2'!BU44","v":0},{"$f":"'BIT-2'!BU47","v":0},{"$f":"'BIT-2'!BU48","v":0},{"$f":"'BIT-2'!BR44","v":""},{"$f":"'BIT-2'!BS44","v":0},{"$f":"'BIT-2'!BR45","v":""},{"$f":"'BIT-2'!BS45","v":0},{"$f":"'BIT-2'!BR46","v":""},{"$f":"'BIT-2'!BS46","v":0},{"$f":"'BIT-2'!BR47","v":""},{"$f":"'BIT-2'!BS47","v":0},{"$f":"'BIT-2'!BR48","v":""},{"$f":"'BIT-2'!BS48","v":0},null,{"$f":"'BIT-2 Precision'!U15","v":0},{"$f":"'BIT-2 Precision'!T15","v":""},{"$f":"'BIT-2 Precision'!S15","v":0}]
["BIT-2","Enterobacterales","Gentamicin",{"$f":"'BIT-2'!AB44","v":0},{"$f":"'BIT-2'!AB47","v":0},{"$f":"'BIT-2'!AB48","v":0},{"$f":"'BIT-2'!Y44","v":""},{"$f":"'BIT-2'!$Z44","v":0},{"$f":"'BIT-2'!Y45","v":""},{"$f":"'BIT-2'!$Z45","v":0},{"$f":"'BIT-2'!Y46","v":""},{"$f":"'BIT-2'!$Z46","v":0},{"$f":"'BIT-2'!Y47","v":""},{"$f":"'BIT-2'!$Z47","v":0},{"$f":"'BIT-2'!Y48","v":""},{"$f":"'BIT-2'!$Z48","v":0},null,{"$f":"'BIT-2 Precision'!U25","v":0},{"$f":"'BIT-2 Precision'!T25","v":""},{"$f":"'BIT-2 Precision'!S25","v":0}]
["BIT-2","Enterobacterales","Piperacillin/tazobactam",{"$f":"'BIT-2'!M44","v":0},{"$f":"'BIT-2'!M47","v":0},{"$f":"'BIT-2'!M48","v":0},{"$f":"'BIT-2'!J44","v":""},{"$f":"'BIT-2'!$K44","v":0},{"$f":"'BIT-2'!J45","v":""},{"$f":"'BIT-2'!$K45","v":0},{"$f":"'BIT-2'!J46","v":""},{"$f":"'BIT-2'!$K46","v":0},{"$f":"'BIT-2'!J47","v":""},{"$f":"'BIT-2'!$K47","v":0},{"$f":"'BIT-2'!J48","v":""},{"$f":"'BIT-2'!$K48","v":0},null,{"$f":"'BIT-2 Precision'!U35","v":0},{"$f":"'BIT-2 Precision'!T35","v":""},{"$f":"'BIT-2 Precision'!S35","v":0}]
["BIT-2","Enterobacterales","Tobramycin",{"$f":"'BIT-2'!AQ44","v":0},{"$f":"'BIT-2'!AQ47","v":0},{"$f":"'BIT-2'!AQ48","v":0},{"$f":"'BIT-2'!AN44","v":""},{"$f":"'BIT-2'!$AO44","v":0},{"$f":"'BIT-2'!AN45","v":""},{"$f":"'BIT-2'!$AO45","v":0},{"$f":"'BIT-2'!AN46","v":""},{"$f":"'BIT-2'!$AO46","v":0},{"$f":"'BIT-2'!AN47","v":""},{"$f":"'BIT-2'!$AO47","v":0},{"$f":"'BIT-2'!AN48","v":""},{"$f":"'BIT-2'!$AO48","v":0},null,{"$f":"'BIT-2 Precision'!U45","v":0},{"$f":"'BIT-2 Precision'!T45","v":""},{"$f":"'BIT-2 Precision'!S45","v":0}]
["BIT-3","Pseudomonas aeruginosa","Aztreonam",{"$f":"'BIT-3'!AQ41","v":0},{"$f":"'BIT-3'!AQ43","v":0},{"$f":"'BIT-3'!AQ44","v":0},{"$f":"'BIT-3'!AN40","v":""},{"$f":"'BIT-3'!$AO40","v":0},{"$f":"'BIT-3'!AN41","v":""},{"$f":"'BIT-3'!$AO41","v":0},{"$f":"'BIT-3'!AN42","v":""},{"$f":"'BIT-3'!$AO42","v":0},{"$f":"'BIT-3'!AN43","v":""},{"$f":"'BIT-3'!$AO43","v":0},{"$f":"'BIT-3'!AN44","v":""},{"$f":"'BIT-3'!$AO44","v":0},null,{"$f":"'BIT-3 Precision'!U6","v":0},{"$f":"'BIT-3 Precision'!T6","v":""},{"$f":"'BIT-3 Precision'!S6","v":0}]
["BIT-3","Pseudomonas aeruginosa","Cefepime",{"$f":"'BIT-3'!BF41","v":0},{"$f":"'BIT-3'!BF43","v":0},{"$f":"'BIT-3'!BF44","v":0},{"$f":"'BIT-3'!BC40","v":""},{"$f":"'BIT-3'!$BD40","v":0},{"$f":"'BIT-3'!BC41","v":""},{"$f":"'BIT-3'!$BD41","v":0},{"$f":"'BIT-3'!BC42","v":""},{"$f":"'BIT-3'!$BD42","v":0},{"$f":"'BIT-3'!BC43","v":""},{"$f":"'BIT-3'!$BD43","v":0},{"$f":"'BIT-3'!BC44","v":""},{"$f":"'BIT-3'!$BD44","v":0},null,{"$f":"'BIT-3 Precision'!U16","v":0},{"$f":"'BIT-3 Precision'!T16","v":""},{"$f":"'BIT-3 Precision'!S16","v":0}]
["BIT-3","Pseudomonas aeruginosa","Ceftazidime",{"$f":"'BIT-3'!BU41","v":0},{"$f":"'BIT-3'!BU43","v":0},{"$f":"'BIT-3'!BU44","v":0},{"$f":"'BIT-3'!BR40","v":""},{"$f":"'BIT-3'!$BS40","v":0},{"$f":"'BIT-3'!BR41","v":""},{"$f":"'BIT-3'!$BS41","v":0},{"$f":"'BIT-3'!BR42","v":""},{"$f":"'BIT-3'!$BS42","v":0},{"$f":"'BIT-3'!BR43","v":""},{"$f":"'BIT-3'!$BS43","v":0},{"$f":"'BIT-3'!BR44","v":""},{"$f":"'BIT-3'!$BS44","v":0},null,{"$f":"'BIT-3 Precision'!U26","v":0},{"$f":"'BIT-3 Precision'!T26","v":""},{"$f":"'BIT-3 Precision'!S26","v":0}]
["BIT-3","Pseudomonas aeruginosa","Ciprofloxacin",{"$f":"'BIT-3'!CJ41","v":0},{"$f":"'BIT-3'!CJ43","v":0},{"$f":"'BIT-3'!CJ44","v":0},{"$f":"'BIT-3'!CG40","v":""},{"$f":"'BIT-3'!$CH40","v":0},{"$f":"'BIT-3'!CG41","v":""},{"$f":"'BIT-3'!$CH41","v":0},{"$f":"'BIT-3'!CG42","v":""},{"$f":"'BIT-3'!$CH42","v":0},{"$f":"'BIT-3'!CG43","v":""},{"$f":"'BIT-3'!$CH43","v":0},{"$f":"'BIT-3'!CG44","v":""},{"$f":"'BIT-3'!$CH44","v":0},null,{"$f":"'BIT-3 Precision'!U36","v":0},{"$f":"'BIT-3 Precision'!T36","v":""},{"$f":"'BIT-3 Precision'!S36","v":0}]
["BIT-3","Pseudomonas aeruginosa","Colistin",{"$f":"'BIT-3'!ER40","v":0},{"$f":"'BIT-3'!ER43","v":0},{"$f":"'BIT-3'!ER44","v":0},{"$f":"'BIT-3'!EO40","v":""},{"$f":"'BIT-3'!EP40","v":0},{"$f":"'BIT-3'!EO41","v":""},{"$f":"'BIT-3'!EP41","v":0},{"$f":"'BIT-3'!EO42","v":""},{"$f":"'BIT-3'!EP42","v":0},{"$f":"'BIT-3'!EO43","v":""},{"$f":"'BIT-3'!EP43","v":0},{"$f":"'BIT-3'!EO44","v":""},{"$f":"'BIT-3'!EP44","v":0},null,{"$f":"'BIT-3 Precision'!U46","v":0},{"$f":"'BIT-3 Precision'!T46","v":""},{"$f":"'BIT-3 Precision'!S46","v":0}]
["BIT-3","Pseudomonas aeruginosa","Imipenem",{"$f":"'BIT-3'!AB41","v":0},{"$f":"'BIT-3'!AB43","v":0},{"$f":"'BIT-3'!AB44","v":0},{"$f":"'BIT-3'!Y40","v":""},{"$f":"'BIT-3'!$Z40","v":0},{"$f":"'BIT-3'!Y41","v":""},{"$f":"'BIT-3'!$Z41","v":0},{"$f":"'BIT-3'!Y42","v":""},{"$f":"'BIT-3'!$Z42","v":0},{"$f":"'BIT-3'!Y43","v":""},{"$f":"'BIT-3'!$Z43","v":0},{"$f":"'BIT-3'!Y44","v":""},{"$f":"'BIT-3'!$Z44","v":0},null,{"$f":"'BIT-3 Precision'!U56","v":0},{"$f":"'BIT-3 Precision'!T56","v":""},{"$f":"'BIT-3 Precision'!S56","v":0}]
["BIT-3","Pseudomonas aeruginosa","Levofloxacin",{"$f":"'BIT-3'!CY41","v":0},{"$f":"'BIT-3'!CY43","v":0},{"$f":"'BIT-3'!CY44","v":0},{"$f":"'BIT-3'!CV40","v":""},{"$f":"'BIT-3'!$CW40","v":0},{"$f":"'BIT-3'!CV41","v":""},{"$f":"'BIT-3'!$CW41","v":0},{"$f":"'BIT-3'!CV42","v":""},{"$f":"'BIT-3'!$CW42","v":0},{"$f":"'BIT-3'!CV43","v":""},{"$f":"'BIT-3'!$CW43","v":0},{"$f":"'BIT-3'!CV44","v":""},{"$f":"'BIT-3'!$CW44","v":0},null,{"$f":"'BIT-3 Precision'!U66","v":0},{"$f":"'BIT-3 Precision'!T66","v":""},{"$f":"'BIT-3 Precision'!S66","v":0}]
["BIT-3","Pseudomonas aeruginosa","Meropenem",{"$f":"'BIT-3'!M41","v":0},{"$f":"'BIT-3'!M43","v":0},{"$f":"'BIT-3'!M44","v":0},{"$f":"'BIT-3'!J40","v":""},{"$f":"'BIT-3'!$K40","v":0},{"$f":"'BIT-3'!J41","v":""},{"$f":"'BIT-3'!$K41","v":0},{"$f":"'BIT-3'!J42","v":""},{"$f":"'BIT-3'!$K42","v":0},{"$f":"'BIT-3'!J43","v":""},{"$f":"'BIT-3'!$K43","v":0},{"$f":"'BIT-3'!J44","v":""},{"$f":"'BIT-3'!$K44","v":0},null,{"$f":"'BIT-3 Precision'!U76","v":0},{"$f":"'BIT-3 Precision'!T76","v":""},{"$f":"'BIT-3 Precision'!S76","v":0}]
["BIT-3","Pseudomonas aeruginosa","Piperacillin/tazobactam",{"$f":"'BIT-3'!DN41","v":0},{"$f":"'BIT-3'!DN43","v":0},{"$f":"'BIT-3'!DN44","v":0},{"$f":"'BIT-3'!DK40","v":""},{"$f":"'BIT-3'!$DL40","v":0},{"$f":"'BIT-3'!DK41","v":""},{"$f":"'BIT-3'!$DL41","v":0},{"$f":"'BIT-3'!DK42","v":""},{"$f":"'BIT-3'!$DL42","v":0},{"$f":"'BIT-3'!DK43","v":""},{"$f":"'BIT-3'!$DL43","v":0},{"$f":"'BIT-3'!DK44","v":""},{"$f":"'BIT-3'!$DL44","v":0},null,{"$f":"'BIT-3 Precision'!U86","v":0},{"$f":"'BIT-3 Precision'!T86","v":""},{"$f":"'BIT-3 Precision'!S86","v":0}]
["BIT-3","Pseudomonas aeruginosa","Tobramycin",{"$f":"'BIT-3'!EC41","v":0},{"$f":"'BIT-3'!EC43","v":0},{"$f":"'BIT-3'!EC44","v":0},{"$f":"'BIT-3'!DZ40","v":""},{"$f":"'BIT-3'!$EA40","v":0},{"$f":"'BIT-3'!DZ41","v":""},{"$f":"'BIT-3'!$EA41","v":0},{"$f":"'BIT-3'!DZ42","v":""},{"$f":"'BIT-3'!$EA42","v":0},{"$f":"'BIT-3'!DZ43","v":""},{"$f":"'BIT-3'!$EA43","v":0},{"$f":"'BIT-3'!DZ44","v":""},{"$f":"'BIT-3'!$EA44","v":0},null,{"$f":"'BIT-3 Precision'!U96","v":0},{"$f":"'BIT-3 Precision'!T96","v":""},{"$f":"'BIT-3 Precision'!S96","v":0}]
["BIT-4","Acinetobacter baumannii","Colistin",{"$f":"'BIT-4'!AQ44","v":0},{"$f":"'BIT-4'!AQ47","v":0},{"$f":"'BIT-4'!AQ48","v":0},{"$f":"'BIT-4'!AN44","v":""},{"$f":"'BIT-4'!AO44","v":0},{"$f":"'BIT-4'!AN45","v":""},{"$f":"'BIT-4'!AO45","v":0},{"$f":"'BIT-4'!AN46","v":""},{"$f":"'BIT-4'!AO46","v":0},{"$f":"'BIT-4'!AN47","v":""},{"$f":"'BIT-4'!AO47","v":0},{"$f":"'BIT-4'!AN48","v":""},{"$f":"'BIT-4'!AO48","v":0},null,{"$f":"'BIT-4 Precision'!U26","v":0},{"$f":"'BIT-4 Precision'!T26","v":""},{"$f":"'BIT-4 Precision'!S26","v":0}]
["BIT-4","Acinetobacter baumannii","Imipenem",{"$f":"'BIT-4'!AB44","v":0},{"$f":"'BIT-4'!AB47","v":0},{"$f":"'BIT-4'!AB48","v":0},{"$f":"'BIT-4'!Y44","v":""},{"$f":"'BIT-4'!$Z44","v":0},{"$f":"'BIT-4'!Y45","v":""},{"$f":"'BIT-4'!$Z45","v":0},{"$f":"'BIT-4'!Y46","v":""},{"$f":"'BIT-4'!$Z46","v":0},{"$f":"'BIT-4'!Y47","v":""},{"$f":"'BIT-4'!$Z47","v":0},{"$f":"'BIT-4'!Y48","v":""},{"$f":"'BIT-4'!$Z48","v":0},null,{"$f":"'BIT-4 Precision'!U6","v":0},{"$f":"'BIT-4 Precision'!T6","v":""},{"$f":"'BIT-4 Precision'!S6","v":0}]
["BIT-4","Acinetobacter baumannii","Meropenem",{"$f":"'BIT-4'!M44","v":0},{"$f":"'BIT-4'!M47","v":0},{"$f":"'BIT-4'!M48","v":0},{"$f":"'BIT-4'!J44","v":""},{"$f":"'BIT-4'!$K44","v":0},{"$f":"'BIT-4'!J45","v":""},{"$f":"'BIT-4'!$K45","v":0},{"$f":"'BIT-4'!J46","v":""},{"$f":"'BIT-4'!$K46","v":0},{"$f":"'BIT-4'!J47","v":""},{"$f":"'BIT-4'!$K47","v":0},{"$f":"'BIT-4'!J48","v":""},{"$f":"'BIT-4'!$K48","v":0},null,{"$f":"'BIT-4 Precision'!U16","v":0},{"$f":"'BIT-4 Precision'!T16","v":""},{"$f":"'BIT-4 Precision'!S16","v":0}]
["NA","Combined","Aztreonam",{"$f":"SUM('BIT-3'!AQ41,'BIT-1'!BU42)","v":0},{"$f":"SUM('BIT-1'!BU45,'BIT-3'!AQ43)","v":0},{"$f":"SUM('BIT-1'!BU46,'BIT-3'!AQ44)","v":0},{"$f":"IF(D33=0,\"\",H33/D33)","v":""},{"$f":"SUM('BIT-1'!BS42,'BIT-3'!AO40)","v":0},{"$f":"(IF(D33=0, \"\",J33/D33))","v":""},{"$f":"SUM('BIT-1'!BS43,'BIT-3'!AO41)","v":0},{"$f":"IF(D33=0,\"\",L33/D33)","v":""},{"$f":"SUM('BIT-1'!BS44,'BIT-3'!AO42)","v":0},{"$f":"IF(D33=0,\"\",N33/E33)","v":""},{"$f":"SUM('BIT-1'!BS45,'BIT-3'!AO43)","v":0},{"$f":"IF(D33=0,\"\",P33/F33)","v":""},{"$f":"SUM('BIT-1'!BS46,'BIT-3'!AO44)","v":0},null,{"$f":"SUM('BIT-1 Precision'!U6,'BIT-3 Precision'!U6)","v":0},{"$f":"IF(R33>0, T33/R33,\"\")","v":""},{"$f":"SUM('BIT-1 Precision'!S6,'BIT-3 Precision'!S6)","v":0}]
["NA","Combined","Cefepime",{"$f":"SUM('BIT-1'!CJ42,'BIT-3'!BF41)","v":0},{"$f":"SUM('BIT-1'!CJ45,'BIT-3'!BF43)","v":0},{"$f":"SUM('BIT-1'!CJ46,'BIT-3'!BF44)","v":0},"",{"$f":"SUM('BIT-1'!CH42,'BIT-3'!BD40)","v":0},"",{"$f":"SUM('BIT-1'!CH43,'BIT-3'!BD41)","v":0},"",{"$f":"SUM('BIT-1'!CH44,'BIT-3'!BD42)","v":0},"",{"$f":"SUM('BIT-1'!CH45,'BIT-3'!BD43)","v":0},{"$f":"IF(D34=0,\"\",P34/F34)","v":""},{"$f":"SUM('BIT-1'!CH46,'BIT-3'!BD44)","v":0},null,{"$f":"SUM('BIT-1 Precision'!U26,'BIT-3 Precision'!U16)","v":0},"",{"$f":"SUM('BIT-1 Precision'!S26,'BIT-3 Precision'!S16)","v":0}]
["NA","Combined","Ceftazidime",{"$f":"SUM('BIT-1'!CY42,'BIT-3'!BU41)","v":0},{"$f":"SUM('BIT-1'!CY45,'BIT-3'!BU43)","v":0},{"$f":"SUM('BIT-1'!CY46,'BIT-3'!BU44)","v":0},"",{"$f":"SUM('BIT-1'!CW42,'BIT-3'!BS40)","v":0},"",{"$f":"SUM('BIT-1'!CW43,'BIT-3'!BS41)","v":0},"",{"$f":"SUM('BIT-1'!CW44,'BIT-3'!BS42)","v":0},"",{"$f":"SUM('BIT-1'!CW45,'BIT-3'!BS43)","v":0},{"$f":"IF(D35=0,\"\",P35/F35)","v":""},{"$f":"SUM('BIT-1'!CW46,'BIT-3'!BS44)","v":0},null,{"$f":"SUM('BIT-1 Precision'!U46,'BIT-3 Precision'!U26)","v":0},"",{"$f":"SUM('BIT-1 Precision'!S46,'BIT-3 Precision'!S26)","v":0}]
["NA","Combined","Ciprofloxacin",{"$f":"SUM('BIT-1'!ER42,'BIT-3'!CJ41)","v":0},{"$f":"SUM('BIT-1'!ER45,'BIT-3'!CJ43)","v":0},{"$f":"SUM('BIT-1'!ER46,'BIT-3'!CJ44)","v":0},"",{"$f":"SUM('BIT-1'!EP42,'BIT-3'!CH40)","v":0},"",{"$f":"SUM('BIT-1'!EP43,'BIT-3'!CH41)","v":0},"",{"$f":"SUM('BIT-1'!EP44,'BIT-3'!CH42)","v":0},"",{"$f":"SUM('BIT-1'!EP45,'BIT-3'!CH43)","v":0},{"$f":"IF(D36=0,\"\",P36/F36)","v":""},{"$f":"SUM('BIT-1'!EP46,'BIT-3'!CH44)","v":0},null,{"$f":"SUM('BIT-1 Precision'!U66,'BIT-3 Precision'!U36)","v":0},"",{"$f":"SUM('BIT-1 Precision'!S66,'BIT-3 Precision'!S36)","v":0}]
["NA","Combined","Colistin",{"$f":"SUM('BIT-2'!BU44,'BIT-3'!ER40,'BIT-4'!AQ44)","v":0},{"$f":"SUM('BIT-2'!BU47,'BIT-3'!ER43,'BIT-4'!AQ47)","v":0},{"$f":"SUM('BIT-2'!BU48,'BIT-3'!ER44,'BIT-4'!AQ48)","v":0},"",{"$f":"SUM('BIT-2'!BS44,'BIT-3'!EP40,'BIT-4'!AO44)","v":0},"",{"$f":"SUM('BIT-2'!BS45,'BIT-3'!EP41,'BIT-4'!AO45)","v":0},"",{"$f":"SUM('BIT-2'!BS46,'BIT-3'!EP42,'BIT-4'!AO46)","v":0},"",{"$f":"SUM('BIT-2'!BS47,'BIT-3'!EP43,'BIT-4'!AO47)","v":0},null,{"$f":"SUM('BIT-2'!BS48,'BIT-3'!EP44,'BIT-4'!AO48)","v":0},null,{"$f":"SUM('BIT-2 Precision'!U15,'BIT-3 Precision'!U46,'BIT-4 Precision'!U26)","v":0},"",{"$f":"SUM('BIT-2 Precision'!S15,'BIT-3 Precision'!S46,'BIT-4 Precision'!S26)","v":0}]
["NA","Combined","Imipenem",{"$f":"SUM('BIT-1'!AQ42,'BIT-3'!AB41,'BIT-4'!AB44)","v":0},{"$f":"SUM('BIT-1'!AQ45,'BIT-3'!AB43,'BIT-4'!AB47)","v":0},{"$f":"SUM('BIT-1'!AQ46,'BIT-3'!AB44,'BIT-4'!AB48)","v":0},"",{"$f":"SUM('BIT-1'!AO42,'BIT-3'!Z40,'BIT-4'!Z44)","v":0},"",{"$f":"SUM('BIT-1'!AO43,'BIT-3'!Z41,'BIT-4'!Z45)","v":0},"",{"$f":"SUM('BIT-1'!AO44,'BIT-3'!Z42,'BIT-4'!Z46)","v":0},"",{"$f":"SUM('BIT-1'!AO45,'BIT-3'!Z43,'BIT-4'!Z47)","v":0},{"$f":"IF(D38=0,\"\",P38/F38)","v":""},{"$f":"SUM('BIT-1'!AO46,'BIT-3'!Z44,'BIT-4'!Z48)","v":0},null,{"$f":"SUM('BIT-1 Precision'!U86,'BIT-3 Precision'!U56,'BIT-4 Precision'!U6)","v":0},"",{"$f":"SUM('BIT-1 Precision'!S86,'BIT-3 Precision'!S56,'BIT-4 Precision'!S6)","v":0}]
["NA","Combined","Levofloxacin",{"$f":"SUM('BIT-1'!FG42,'BIT-3'!CY41)","v":0},{"$f":"SUM('BIT-1'!FG45,'BIT-3'!CY43)","v":0},{"$f":"SUM('BIT-1'!FG46,'BIT-3'!CY44)","v":0},"",{"$f":"SUM('BIT-1'!FE42,'BIT-3'!CW40)","v":0},"",{"$f":"SUM('BIT-1'!FE43,'BIT-3'!CW41)","v":0},"",{"$f":"SUM('BIT-1'!FE44,'BIT-3'!CW42)","v":0},"",{"$f":"SUM('BIT-1'!FE45,'BIT-3'!CW43)","v":0},{"$f":"IF(D39=0,\"\",P39/F39)","v":""},{"$f":"SUM('BIT-1'!FE46,'BIT-3'!CW44)","v":0},null,{"$f":"SUM('BIT-1 Precision'!U96,'BIT-3 Precision'!U66)","v":0},"",{"$f":"SUM('BIT-1 Precision'!S96,'BIT-3 Precision'!S66)","v":0}]
["NA","Combined","Meropenem",{"$f":"SUM('BIT-1'!AB42,'BIT-3'!M41,'BIT-4'!M44)","v":0},{"$f":"SUM('BIT-1'!AB45,'BIT-3'!M43,'BIT-4'!M47)","v":0},{"$f":"SUM('BIT-1'!AB46,'BIT-3'!M44,'BIT-4'!M48)","v":0},"",{"$f":"SUM('BIT-1'!Z42,'BIT-3'!K40,'BIT-4'!K44)","v":0},"",{"$f":"SUM('BIT-1'!Z43,'BIT-3'!K41,'BIT-4'!K45)","v":0},"",{"$f":"SUM('BIT-1'!Z44,'BIT-3'!K42,'BIT-4'!K46)","v":0},"",{"$f":"SUM('BIT-1'!Z45,'BIT-3'!K43,'BIT-4'!K47)","v":0},{"$f":"IF(D40=0,\"\",P40/F40)","v":""},{"$f":"SUM('BIT-1'!Z46,'BIT-3'!K44,'BIT-4'!K48)","v":0},null,{"$f":"SUM('BIT-1 Precision'!U106,'BIT-3 Precision'!U76,'BIT-4 Precision'!U16)","v":0},"",{"$f":"SUM('BIT-1 Precision'!S106,'BIT-3 Precision'!S76,'BIT-4 Precision'!S16)","v":0}]
["NA","Combined","Piperacillin/tazobactam",{"$f":"SUM('BIT-2'!M44,'BIT-3'!DN41)","v":0},{"$f":"SUM('BIT-2'!M47,'BIT-3'!DN43)","v":0},{"$f":"SUM('BIT-2'!M48,'BIT-3'!DN44)","v":0},"",{"$f":"SUM('BIT-2'!K44,'BIT-3'!DL40)","v":0},"",{"$f":"SUM('BIT-2'!K45,'BIT-3'!DL41)","v":0},"",{"$f":"SUM('BIT-2'!K46,'BIT-3'!DL42)","v":0},"",{"$f":"SUM('BIT-2'!K47,'BIT-3'!DL43)","v":0},{"$f":"IF(D41=0,\"\",P41/F41)","v":""},{"$f":"SUM('BIT-2'!K48,'BIT-3'!DL44)","v":0},null,{"$f":"SUM('BIT-2 Precision'!U35,'BIT-3 Precision'!U86)","v":0},"",{"$f":"SUM('BIT-2 Precision'!S35,'BIT-3 Precision'!S86)","v":0}]
["NA","Combined","Tobramycin",{"$f":"SUM('BIT-2'!AQ44,'BIT-3'!EC41)","v":0},{"$f":"SUM('BIT-2'!AQ47,'BIT-3'!EC43)","v":0},{"$f":"SUM('BIT-2'!AQ48,'BIT-3'!EC44)","v":0},"",{"$f":"SUM('BIT-2'!AO44,'BIT-3'!EA40)","v":0},"",{"$f":"SUM('BIT-2'!AO45,'BIT-3'!EA41)","v":0},"",{"$f":"SUM('BIT-2'!AO46,'BIT-3'!EA42)","v":0},"",{"$f":"SUM('BIT-2'!AO47,'BIT-3'!EA43)","v":0},{"$f":"IF(D42=0,\"\",P42/F42)","v":""},{"$f":"SUM('BIT-2'!AO48,'BIT-3'!EA44)","v":0},null,{"$f":"SUM('BIT-2 Precision'!U45,'BIT-3 Precision'!U96)","v":0},"",{"$f":"SUM('BIT-2 Precision'!S45,'BIT-3 Precision'!S96)","v":0}]

{"sheet":"BIT-1","index":3,"n_rows":46,"n_cols":169,"rows_kept":46,"cut":false,"hidden":false,"merged":[[0,109,0,123],[4,109,4,112],[4,114,4,118],[4,119,4,123],[0,154,0,168],[4,154,4,157],[4,159,4,163],[4,164,4,168],[0,124,0,138],[4,124,4,127],[4,129,4,133],[4,134,4,138],[0,139,0,153],[4,139,4,142],[4,144,4,148],[4,149,4,153],[0,79,0,93],[4,79,4,82],[4,84,4,88],[4,89,4,93],[0,94,0,108],[4,94,4,97],[4,99,4,103],[4,104,4,108],[4,59,4,63],[0,64,0,78],[4,64,4,67],[4,69,4,73],[4,74,4,78],[4,54,4,58],[4,2,4,3],[4,4,4,7],[4,9,4,13],[4,14,4,18],[4,19,4,22],[4,24,4,28],[4,29,4,33],[4,34,4,37],[4,39,4,43],[4,44,4,48],[4,49,4,52],[1,52,3,58],[0,4,0,18],[0,19,0,33],[0,34,0,48],[0,49,0,63],[4,0,4,1],[38,0,40,3],[1,0,3,3],[0,0,0,3],[39,9,39,12],[39,24,39,27],[39,39,39,42],[39,54,39,55],[39,84,39,87],[39,69,39,72],[37,49,37,63],[39,114,39,117],[39,99,39,102],[39,159,39,162],[39,144,39,147],[39,129,39,132]]}
["AR Bank BIT Validation Set",null,null,null,"Ertapenem Breakpoints 0.5(S)/1(I)/2(R)",null,null,null,null,null,null,null,null,null,null,null,null,null,null,"Meropenem Breakpoints 1(S)/2(I)/4(R)",null,null,null,null,null,null,null,null,null,null,null,null,null,null,"Imipenem Breakpoints 1(S)/2(I)/4(R)",null,null,null,null,null,null,null,null,null,null,null,null,null,null,"Cefazolin* Breakpoints 2(S)/4(I)/8(R)",null,null,null,null,null,null,null,null,null,null,null,null,null,null,"Aztreonam Breakpoints 4(S)/8(I)/16(R)",null,null,null,null,null,null,null,null,null,null,null,null,null,null,"Cefepime Breakpoints 2(S)/4-8(SDD)/16(R)",null,null,null,null,null,null,null,null,null,null,null,null,null,null,"Ceftazidime Breakpoints 4(S)/8(I)/16(R)",null,null,null,null,null,null,null,null,null,null,null,null,null,null,"Cefotaxime Breakpoints 1(S)/2(I)/4(R)",null,null,null,null,null,null,null,null,null,null,null,null,null,null,"Ceftriaxone Breakpoints 1(S)/2(I)/4(R)",null,null,null,null,null,null,null,null,null,null,null,null,null,null,"Ciprofloxacin Breakpoints 0.25(S)/0.5(I)/1(R)",null,null,null,null,null,null,null,null,null,null,null,null,null,null,"Levofloxacin Breakpoints 0.5(S)/1(I)/2(R)"]
["This set can be used to validate Enterobacterales and the following antimicrobials: ertapenem, meropenem, imipenem, cefazolin*, aztreonam, cefepime, ceftazidime, cefotaxime, ceftriaxone, ciprofloxacin, levofloxacin",null,null,null,"N 'S'",{"$f":"COUNTIF(H$7:H$37,\"S\")","v":21},null,null,null,null,null,null,null,null,null,null,null,null,null,"N 'S'",{"$f":"COUNTIF(W$7:W$37,\"S\")","v":22},null,null,null,null,null,null,null,null,null,null,null,null,null,"N 'S'",{"$f":"COUNTIF(AL$7:AL$37,\"S\")","v":22},null,null,null,null,null,null,null,null,null,null,null,null,null,"N 'S'",{"$f":"COUNTIF(BA$7:BA$37,\"S\")","v":2},null,null,null,null,null,null,null,null,null,null,null,null,null,"N 'S'",{"$f":"COUNTIF(BP$7:BP$37,\"S\")","v":17},null,null,null,null,null,null,null,null,null,null,null,null,null,"N 'S'",{"$f":"COUNTIF(CE$7:CE$37,\"S\")","v":17},null,null,null,null,null,null,null,null,null,null,null,null,null,"N 'S'",{"$f":"COUNTIF(CT$7:CT$37,\"S\")","v":17},null,null,null,null,null,null,null,null,null,null,null,null,null,"N 'S'",{"$f":"COUNTIF(DI$7:DI$37,\"S\")","v":16},null,null,null,null,null,null,null,null,null,null,null,null,null,"N 'S'",{"$f":"COUNTIF(DX$7:DX$37,\"S\")","v":16},null,null,null,null,null,null,null,null,null,null,null,null,null,"N 'S'",{"$f":"COUNTIF(EM$7:EM$37,\"S\")","v":15},null,null,null,null,null,null,null,null,null,null,null,null,null,"N 'S'",{"$f":"COUNTIF(FB$7:FB$37,\"S\")","v":13}]
[null,null,null,null,"N 'I'",{"$f":"COUNTIF(H$7:H$37,\"I\")","v":0},null,null,null,null,null,null,null,null,null,null,null,null,null,"N 'I'",{"$f":"COUNTIF(W$7:W$37,\"I\")","v":3},null,null,null,null,null,null,null,null,null,null,null,null,null,"N 'I'",{"$f":"COUNTIF(AL$7:AL$37,\"I\")","v":0},null,null,null,null,null,null,null,null,null,null,null,null,null,"N 'I'",{"$f":"COUNTIF(BA$7:BA$37,\"I\")","v":1},null,null,null,null,null,null,null,null,null,null,null,null,null,"N 'I'",{"$f":"COUNTIF(BP$7:BP$37,\"I\")","v":0},null,null,null,null,null,null,null,null,null,null,null,null,null,"N 'SDD'",{"$f":"COUNTIF(CE$7:CE$37,\"SDD\")","v":3},null,null,null,null,null,null,null,null,null,null,null,null,null,"N 'I'",{"$f":"COUNTIF(CT$7:CT$37,\"I\")","v":0},null,null,null,null,null,null,null,null,null,null,null,null,null,"N 'I'",{"$f":"COUNTIF(DI$7:DI$37,\"I\")","v":0},null,null,null,null,null,null,null,null,null,null,null,null,null,"N 'I'",{"$f":"COUNTIF(DX$7:DX$37,\"I\")","v":0},null,null,null,null,null,null,null,null,null,null,null,null,null,"N 'I'",{"$f":"COUNTIF(EM$7:EM$37,\"I\")","v":0},null,null,null,null,null,null,null,null,null,null,null,null,null,"N 'I'",{"$f":"COUNTIF(FB$7:FB$37,\"I\")","v":3}]
[null,null,null,null,"N 'R'",{"$f":"COUNTIF(H$7:H$37,\"R\")","v":10},null,null,null,null,null,null,null,null,null,null,null,null,null,"N 'R'",{"$f":"COUNTIF(W$7:W$37,\"R\")","v":6},null,null,null,null,null,null,null,null,null,null,null,null,null,"N 'R'",{"$f":"COUNTIF(AL$7:AL$37,\"R\")","v":9},null,null,null,null,null,null,null,null,null,null,null,null,null,"N 'R'",{"$f":"COUNTIF(BA$7:BA$37,\"R\")","v":16},null,null,null,null,null,null,null,null,null,null,null,null,null,"N 'R'",{"$f":"COUNTIF(BP$7:BP$37,\"R\")","v":14},null,null,null,null,null,null,null,null,null,null,null,null,null,"N 'R'",{"$f":"COUNTIF(CE$7:CE$37,\"R\")","v":11},null,null,null,null,null,null,null,null,null,null,null,null,null,"N 'R'",{"$f":"COUNTIF(CT$7:CT$37,\"R\")","v":14},null,null,null,null,null,null,null,null,null,null,null,null,null,"N 'R'",{"$f":"COUNTIF(DI$7:DI$37,\"R\")","v":15},null,null,null,null,null,null,null,null,null,null,null,null,null,"N 'R'",{"$f":"COUNTIF(DX$7:DX$37,\"R\")","v":15},null,null,null,null,null,null,null,null,null,null,null,null,null,"N 'R'",{"$f":"COUNTIF(EM$7:EM$37,\"R\")","v":15},null,null,null,null,null,null,null,null,null,null,null,null,null,"N 'R'",{"$f":"COUNTIF(FB$7:FB$37,\"R\")","v":14}]
["Lab Information",null,"AR Bank Information",null,"Ertapenem AR Bank Data",null,null,null,null,"Ertapenem Test Data ",null,null,null,null,"Ertapenem Calculations",null,null,null,null,"Meropenem AR Bank Data",null,null,null,null," Meropenem Test Data ",null,null,null,null," Meropenem Calculations",null,null,null,null,"Imipenem AR Bank Data",null,null,null,null," Imipenem Test Data ",null,null,null,null,"Imipenem Calculations",null,null,null,null,"Cefazolin AR Bank Data",null,null,null,null,"Cefazolin Test Data ",null,null,null,null,"Cefazolin Calculations",null,null,null,null,"Aztreonam AR Bank Data",null,null,null,null," Aztreonam Test Data ",null,null,null,null,"Aztreonam Calculations",null,null,null,null,"Cefepime AR Bank Data",null,null,null,null," Cefepime Test Data ",null,null,null,null,"Cefepime Calculations",null,null,null,null,"Ceftazidime AR Bank Data",null,null,null,null," Ceftazidime Test Data ",null,null,null,null,"Ceftazidime Calculations",null,null,null,null,"Cefotaxime AR Bank Data",null,null,null,null," Cefotaxime Test Data ",null,null,null,null,"Cefotaxime Calculations",null,null,null,null,"Ceftriaxone AR Bank Data",null,null,null,null," Ceftriaxone Test Data ",null,null,null,null,"Ceftriaxone Calculations",null,null,null,null,"Ciprofloxacin AR Bank Data",null,null,null,null," Ciprofloxacin Test Data ",null,null,null,null,"Ciprofloxacin Calculations",null,null,null,null,"Levofloxacin AR Bank Data",null,null,null,null," Levofloxacin Test Data ",null,null,null,null,"Levofloxacin Calculations"]
["Date Tested","Initials of Tester","AR Bank Number","Organism","Sign","MIC","Hidden MIC Result (conservative)","Interp","Hidden MIC Result Logged","Test Sign","Test  MIC","Hidden MIC Result (conservative)","Test Interp","Hidden MIC Result Logged","EA","Hidden Eval","Dilutions","CA","Error","Sign","MIC","Hidden MIC Result (conservative)","Interp","Hidden MIC Result Logged","Test Sign","Test  MIC","Hidden MIC Result (conservative)","Test Interp","Hidden MIC Result Logged","EA","Hidden Eval","Dilutions","CA","Error","Sign","MIC","Hidden MIC Result (conservative)","Interp","Hidden MIC Result Logged","Test Sign","Test  MIC","Hidden MIC Result (conservative)","Test Interp","Hidden MIC Result Logged","EA","Hidden Eval","Dilutions","CA","Error","Sign","MIC","Hidden MIC Result (conservative)","Interp","Hidden MIC Result Logged","Test Sign","Test  MIC","Hidden MIC Result (conservative)","Test Interp","Hidden MIC Result Logged","EA","Hidden Eval","Dilutions","CA","Error","Sign","MIC","Hidden MIC Result (conservative)","Interp","Hidden MIC Result Logged","Test Sign","Test  MIC","Hidden MIC Result (conservative)","Test Interp","Hidden MIC Result Logged","EA","Hidden Eval","Dilutions","CA","Error","Sign","MIC","Hidden MIC Result (conservative)","Interp","Hidden MIC Result Logged","Test Sign","Test  MIC","Hidden MIC Result (conservative)","Test Interp","Hidden MIC Result Logged","EA","Hidden Eval","Dilutions","CA","Error","Sign","MIC","Hidden MIC Result (conservative)","Interp","Hidden MIC Result Logged","Test Sign","Test  MIC","Hidden MIC Result (conservative)","Test Interp","Hidden MIC Result Logged","EA","Hidden Eval","Dilutions","CA","Error","Sign","MIC","Hidden MIC Result (conservative)","Interp","Hidden MIC Result Logged","Test Sign","Test  MIC","Hidden MIC Result (conservative)","Test Interp","Hidden MIC Result Logged","EA","Hidden Eval","Dilutions","CA","Error","Sign","MIC","Hidden MIC Result (conservative)","Interp","Hidden MIC Result Logged","Test Sign","Test  MIC","Hidden MIC Result (conservative)","Test Interp","Hidden MIC Result Logged","EA","Hidden Eval","Dilutions","CA","Error","Sign","MIC","Hidden MIC Result (conservative)","Interp","Hidden MIC Result Logged","Test Sign","Test  MIC","Hidden MIC Result (conservative)","Test Interp","Hidden MIC Result Logged","EA","Hidden Eval","Dilutions","CA","Error","Sign","MIC","Hidden MIC Result (conservative)","Interp","Hidden MIC Result Logged","Test Sign","Test  MIC","Hidden MIC Result (conservative)","Test Interp","Hidden MIC Result Logged","EA","Hidden Eval","Dilutions","CA","Error"]
[null,null,"AR0001","Escherichia coli",null,8,{"$f":"IF(AND(F7<>\"\"),IF(E7=\">\",F7*2,F7*1),\"\")","v":8},{"$f":"IF((ISNUMBER(G7)),\nIF(G7<=0.5,\"S\",\nIF(G7=1,\"I\",\nIF(G7>=2,\"R\", \"\"))),\"\")","v":"R"},{"$f":"IF(ISNUMBER(G7),ROUND(IMLOG2(G7),1),\"\")","v":3},null,null,{"$f":"IF(AND(ISNUMBER(K7)),IF(J7=\">\",K7*2,K7),\"\")","v":""},{"$f":"IF((ISNUMBER(L7)),\nIF(L7<=0.5,\"S\",\nIF(L7=1,\"I\",\nIF(L7>=2,\"R\", \"\"))),\"\")","v":""},{"$f":"IF(ISNUMBER(L7),ROUND(IMLOG2(L7),1),\"\")","v":""},{"$f":"IF(ISNUMBER(L7),IF(AND(E7=\">\",L7>=G7),\"YES\",IF(AND(OR(J7=\">\",J7=\">=\"),G7>L7),\"YES\",IF(AND(E7=\"<=\",L7<G7),\"YES\",IF(AND(J7=\"<=\",G7<L7),\"YES\",IF(ABS(N7-I7)<=1,\"YES\",\"NO\"))))),\"\")","v":""},{"$f":"IF(ISNUMBER(K7),IF(AND(E7=\"<=\",N7<=I7), \"No\", IF(AND(E7=\"<=\", J7=\"<=\"), \"No\", IF(AND(E7=\">\",N7>=I7), \"No\", IF(AND(J7=\"<=\", I7<=N7), \"No\", IF(AND(OR(J7=\">\",J7=\">=\"),I7>=N7), \"No\", \"yes\"))))),\"\")","v":""},{"$f":"IF(ISNUMBER(K7),IF(AND(J7=\"<=\",E7=\"<=\"),0,IF(AND(OR(J7=\">\",J7=\">=\"),E7=\">\"),0,IF(AND(J7=\"<=\",I7<N7),0, IF(AND(E7=\"<=\", N7<I7),0,IF(AND(OR(E7=\">\", E7=\">=\"),N7>I7),0,IF(AND(OR(J7=\">\", J7=\">=\"),I7>N7),0,IF(ISNUMBER(K7),N7-I7,\"\"))))))),\"\")","v":""},{"$f":"IF(M7<>\"\",IF(EXACT(M7,H7),\"YES\",\"NO\"),\"\")","v":""},{"$f":"IF(M7<>\"\", IF(AND(H7=\"I\",OR(M7=\"S\",M7=\"R\")),\"minE\",IF(AND(M7=\"I\",OR(H7=\"S\",H7=\"R\")),\"minE\",IF(AND(H7=\"R\",M7=\"S\"),\"VME\",IF(AND(H7=\"S\",M7=\"R\"),\"ME\",\"\")))),\"\")","v":""},null,4,{"$f":"IF(AND(U7<>\"\"),IF(T7=\">\",U7*2,U7*1),\"\")","v":4},{"$f":"IF((ISNUMBER(V7)),\nIF(V7<=1,\"S\",\nIF(V7=2,\"I\",\nIF(V7>=4,\"R\", \"\"))),\"\")","v":"R"},{"$f":"IF(ISNUMBER(V7),ROUND(IMLOG2(V7),1),\"\")","v":2},null,null,{"$f":"IF(AND(ISNUMBER(Z7)),IF(Y7=\">\",Z7*2,Z7),\"\")","v":""},{"$f":"IF((ISNUMBER(AA7)),\nIF(AA7<=1,\"S\",\nIF(AA7=2,\"I\",\nIF(AA7>=4,\"R\", \"\"))),\"\")","v":""},{"$f":"IF(ISNUMBER(AA7),ROUND(IMLOG2(AA7),1),\"\")","v":""},{"$f":"IF(ISNUMBER(AA7),IF(AND(T7=\">\",AA7>=V7),\"YES\",IF(AND(OR(Y7=\">\",Y7=\">=\"),V7>AA7),\"YES\",IF(AND(T7=\"<=\",AA7<V7),\"YES\",IF(AND(Y7=\"<=\",V7<AA7),\"YES\",IF(ABS(AC7-X7)<=1,\"YES\",\"NO\"))))),\"\")","v":""},{"$f":"IF(ISNUMBER(Z7),IF(AND(T7=\"<=\",AC7<=X7), \"No\", IF(AND(T7=\"<=\", Y7=\"<=\"), \"No\", IF(AND(T7=\">\",AC7>=X7), \"No\", IF(AND(Y7=\"<=\", X7<=AC7), \"No\", IF(AND(OR(Y7=\">\",Y7=\">=\"),X7>=AC7), \"No\", \"yes\"))))),\"\")","v":""},{"$f":"IF(ISNUMBER(Z7),IF(AND(Y7=\"<=\",T7=\"<=\"),0,IF(AND(OR(Y7=\">\",Y7=\">=\"),T7=\">\"),0,IF(AND(Y7=\"<=\",X7<AC7),0, IF(AND(T7=\"<=\", AC7<X7),0,IF(AND(OR(T7=\">\", T7=\">=\"),AC7>X7),0,IF(AND(OR(Y7=\">\", Y7=\">=\"),X7>AC7),0,IF(ISNUMBER(Z7),AC7-X7,\"\"))))))),\"\")","v":""},{"$f":"IF(AB7<>\"\",IF(EXACT(AB7,W7),\"YES\",\"NO\"),\"\")","v":""},{"$f":"IF(AB7<>\"\", IF(AND(W7=\"I\",OR(AB7=\"S\",AB7=\"R\")),\"minE\",IF(AND(AB7=\"I\",OR(W7=\"S\",W7=\"R\")),\"minE\",IF(AND(W7=\"R\",AB7=\"S\"),\"VME\",IF(AND(W7=\"S\",AB7=\"R\"),\"ME\",\"\")))),\"\")","v":""},null,4,{"$f":"IF(AND(AJ7<>\"\"),IF(AI7=\">\",AJ7*2,AJ7*1),\"\")","v":4},{"$f":"IF((ISNUMBER(AK7)),\nIF(AK7<=1,\"S\",\nIF(AK7=2,\"I\",\nIF(AK7>=4,\"R\", \"\"))),\"\")","v":"R"},{"$f":"IF(ISNUMBER(AK7),ROUND(IMLOG2(AK7),1),\"\")","v":2},null,null,{"$f":"IF(AND(ISNUMBER(AO7)),IF(AN7=\">\",AO7*2,AO7),\"\")","v":""},{"$f":"IF((ISNUMBER(AP7)),\nIF(AP7<=1,\"S\",\nIF(AP7=2,\"I\",\nIF(AP7>=4,\"R\", \"\"))),\"\")","v":""},{"$f":"IF(ISNUMBER(AP7),ROUND(IMLOG2(AP7),1),\"\")","v":""},{"$f":"IF(ISNUMBER(AP7),IF(AND(AI7=\">\",AP7>=AK7),\"YES\",IF(AND(OR(AN7=\">\",AN7=\">=\"),AK7>AP7),\"YES\",IF(AND(AI7=\"<=\",AP7<AK7),\"YES\",IF(AND(AN7=\"<=\",AK7<AP7),\"YES\",IF(ABS(AR7-AM7)<=1,\"YES\",\"NO\"))))),\"\")","v":""},{"$f":"IF(ISNUMBER(AO7),IF(AND(AI7=\"<=\",AR7<=AM7), \"No\", IF(AND(AI7=\"<=\", AN7=\"<=\"), \"No\", IF(AND(AI7=\">\",AR7>=AM7), \"No\", IF(AND(AN7=\"<=\", AM7<=AR7), \"No\", IF(AND(OR(AN7=\">\",AN7=\">=\"),AM7>=AR7), \"No\", \"yes\"))))),\"\")","v":""},{"$f":"IF(ISNUMBER(AO7),IF(AND(AN7=\"<=\",AI7=\"<=\"),0,IF(AND(OR(AN7=\">\",AN7=\">=\"),AI7=\">\"),0,IF(AND(AN7=\"<=\",AM7<AR7),0, IF(AND(AI7=\"<=\", AR7<AM7),0,IF(AND(OR(AI7=\">\", AI7=\">=\"),AR7>AM7),0,IF(AND(OR(AN7=\">\", AN7=\">=\"),AM7>AR7),0,IF(ISNUMBER(AO7),AR7-AM7,\"\"))))))),\"\")","v":""},{"$f":"IF(AQ7<>\"\",IF(EXACT(AQ7,AL7),\"YES\",\"NO\"),\"\")","v":""},{"$f":"IF(AQ7<>\"\", IF(AND(AL7=\"I\",OR(AQ7=\"S\",AQ7=\"R\")),\"minE\",IF(AND(AQ7=\"I\",OR(AL7=\"S\",AL7=\"R\")),\"minE\",IF(AND(AL7=\"R\",AQ7=\"S\"),\"VME\",IF(AND(AL7=\"S\",AQ7=\"R\"),\"ME\",\"\")))),\"\")","v":""},">",8,{"$f":"IF(AND(AY7<>\"\"),IF(AX7=\">\",AY7*2,AY7*1),\"\")","v":16},{"$f":"IF((ISNUMBER(AZ7)),\nIF(AZ7<=2,\"S\",\nIF(AZ7=4,\"I\",\nIF(AZ7>=8,\"R\", \"\"))),\"\")","v":"R"},{"$f":"IF(ISNUMBER(AZ7),ROUND(IMLOG2(AZ7),1),\"\")","v":4},null,null,{"$f":"IF(AND(ISNUMBER(BD7)),IF(BC7=\">\",BD7*2,BD7),\"\")","v":""},{"$f":"IF((ISNUMBER(BE7)),\nIF(BE7<=2,\"S\",\nIF(BE7=4,\"I\",\nIF(BE7>=8,\"R\", \"\"))),\"\")","v":""},{"$f":"IF(ISNUMBER(BE7),ROUND(IMLOG2(BE7),1),\"\")","v":""},{"$f":"IF(ISNUMBER(BE7),IF(AND(AX7=\">\",BE7>=AZ7),\"YES\",IF(AND(OR(BC7=\">\",BC7=\">=\"),AZ7>BE7),\"YES\",IF(AND(AX7=\"<=\",BE7<AZ7),\"YES\",IF(AND(BC7=\"<=\",AZ7<BE7),\"YES\",IF(ABS(BG7-BB7)<=1,\"YES\",\"NO\"))))),\"\")","v":""},{"$f":"IF(ISNUMBER(BD7),IF(AND(AX7=\"<=\",BG7<=BB7), \"No\", IF(AND(AX7=\"<=\", BC7=\"<=\"), \"No\", IF(AND(AX7=\">\",BG7>=BB7), \"No\", IF(AND(BC7=\"<=\", BB7<=BG7), \"No\", IF(AND(OR(BC7=\">\",BC7=\">=\"),BB7>=BG7), \"No\", \"yes\"))))),\"\")","v":""},{"$f":"IF(ISNUMBER(BD7),IF(AND(BC7=\"<=\",AX7=\"<=\"),0,IF(AND(OR(BC7=\">\",BC7=\">=\"),AX7=\">\"),0,IF(AND(BC7=\"<=\",BB7<BG7),0, IF(AND(AX7=\"<=\", BG7<BB7),0,IF(AND(OR(AX7=\">\", AX7=\">=\"),BG7>BB7),0,IF(AND(OR(BC7=\">\", BC7=\">=\"),BB7>BG7),0,IF(ISNUMBER(BD7),BG7-BB7,\"\"))))))),\"\")","v":""},{"$f":"IF(BF7<>\"\",IF(EXACT(BF7,BA7),\"YES\",\"NO\"),\"\")","v":""},{"$f":"IF(BF7<>\"\", IF(AND(BA7=\"I\",OR(BF7=\"S\",BF7=\"R\")),\"minE\",IF(AND(BF7=\"I\",OR(BA7=\"S\",BA7=\"R\")),\"minE\",IF(AND(BA7=\"R\",BF7=\"S\"),\"VME\",IF(AND(BA7=\"S\",BF7=\"R\"),\"ME\",\"\")))),\"\")","v":""},">",64,{"$f":"IF(AND(BN7<>\"\"),IF(BM7=\">\",BN7*2,BN7*1),\"\")","v":128},{"$f":"IF((ISNUMBER(BO7)),\nIF(BO7<=4,\"S\",\nIF(BO7=8,\"I\",\nIF(BO7>=16,\"R\", \"\"))),\"\")","v":"R"},{"$f":"IF(ISNUMBER(BO7),ROUND(IMLOG2(BO7),1),\"\")","v":7},null,null,{"$f":"IF(AND(ISNUMBER(BS7)),IF(BR7=\">\",BS7*2,BS7),\"\")","v":""},{"$f":"IF((ISNUMBER(BT7)),\nIF(BT7<=4,\"S\",\nIF(BT7=8,\"I\",\nIF(BT7>=16,\"R\", \"\"))),\"\")","v":""},{"$f":"IF(ISNUMBER(BT7),ROUND(IMLOG2(BT7),1),\"\")","v":""},{"$f":"IF(ISNUMBER(BT7),IF(AND(BM7=\">\",BT7>=BO7),\"YES\",IF(AND(OR(BR7=\">\",BR7=\">=\"),BO7>BT7),\"YES\",IF(AND(BM7=\"<=\",BT7<BO7),\"YES\",IF(AND(BR7=\"<=\",BO7<BT7),\"YES\",IF(ABS(BV7-BQ7)<=1,\"YES\",\"NO\"))))),\"\")","v":""},{"$f":"IF(ISNUMBER(BS7),IF(AND(BM7=\"<=\",BV7<=BQ7), \"No\", IF(AND(BM7=\"<=\", BR7=\"<=\"), \"No\", IF(AND(BM7=\">\",BV7>=BQ7), \"No\", IF(AND(BR7=\"<=\", BQ7<=BV7), \"No\", IF(AND(OR(BR7=\">\",BR7=\">=\"),BQ7>=BV7), \"No\", \"yes\"))))),\"\")","v":""},{"$f":"IF(ISNUMBER(BS7),IF(AND(BR7=\"<=\",BM7=\"<=\"),0,IF(AND(OR(BR7=\">\",BR7=\">=\"),BM7=\">\"),0,IF(AND(BR7=\"<=\",BQ7<BV7),0, IF(AND(BM7=\"<=\", BV7<BQ7),0,IF(AND(OR(BM7=\">\", BM7=\">=\"),BV7>BQ7),0,IF(AND(OR(BR7=\">\", BR7=\">=\"),BQ7>BV7),0,IF(ISNUMBER(BS7),BV7-BQ7,\"\"))))))),\"\")","v":""},{"$f":"IF(BU7<>\"\",IF(EXACT(BU7,BP7),\"YES\",\"NO\"),\"\")","v":""},{"$f":"IF(BU7<>\"\", IF(AND(BP7=\"I\",OR(BU7=\"S\",BU7=\"R\")),\"minE\",IF(AND(BU7=\"I\",OR(BP7=\"S\",BP7=\"R\")),\"minE\",IF(AND(BP7=\"R\",BU7=\"S\"),\"VME\",IF(AND(BP7=\"S\",BU7=\"R\"),\"ME\",\"\")))),\"\")","v":""},">",32,{"$f":"IF(AND(CC7<>\"\"),IF(CB7=\">\",CC7*2,CC7*1),\"\")","v":64},{"$f":"IF((ISNUMBER(CD7)),\nIF(CD7<=2,\"S\",\nIF(OR(CD7=8, CD7=4),\"SDD\",\nIF(CD7>=16,\"R\", \"\"))),\"\")","v":"R"},{"$f":"IF(ISNUMBER(CD7),ROUND(IMLOG2(CD7),1),\"\")","v":6},null,null,{"$f":"IF(AND(ISNUMBER(CH7)),IF(CG7=\">\",CH7*2,CH7),\"\")","v":""},{"$f":"IF((ISNUMBER(CI7)),\nIF(CI7<=2,\"S\",\nIF(OR(CI7=8, CI7=4),\"SDD\",\nIF(CI7>=16,\"R\", \"\"))),\"\")","v":""},{"$f":"IF(ISNUMBER(CI7),ROUND(IMLOG2(CI7),1),\"\")","v":""},{"$f":"IF(ISNUMBER(CI7),IF(AND(CB7=\">\",CI7>=CD7),\"YES\",IF(AND(OR(CG7=\">\",CG7=\">=\"),CD7>CI7),\"YES\",IF(AND(CB7=\"<=\",CI7<CD7),\"YES\",IF(AND(CG7=\"<=\",CD7<CI7),\"YES\",IF(ABS(CK7-CF7)<=1,\"YES\",\"NO\"))))),\"\")","v":""},{"$f":"IF(ISNUMBER(CH7),IF(AND(CB7=\"<=\",CK7<=CF7), \"No\", IF(AND(CB7=\"<=\", CG7=\"<=\"), \"No\", IF(AND(CB7=\">\",CK7>=CF7), \"No\", IF(AND(CG7=\"<=\", CF7<=CK7), \"No\", IF(AND(OR(CG7=\">\",CG7=\">=\"),CF7>=CK7), \"No\", \"yes\"))))),\"\")","v":""},{"$f":"IF(ISNUMBER(CH7),IF(AND(CG7=\"<=\",CB7=\"<=\"),0,IF(AND(OR(CG7=\">\",CG7=\">=\"),CB7=\">\"),0,IF(AND(CG7=\"<=\",CF7<CK7),0, IF(AND(CB7=\"<=\", CK7<CF7),0,IF(AND(OR(CB7=\">\", CB7=\">=\"),CK7>CF7),0,IF(AND(OR(CG7=\">\", CG7=\">=\"),CF7>CK7),0,IF(ISNUMBER(CH7),CK7-CF7,\"\"))))))),\"\")","v":""},{"$f":"IF(CJ7<>\"\",IF(EXACT(CJ7,CE7),\"YES\",\"NO\"),\"\")","v":""},{"$f":"IF(CJ7<>\"\", IF(AND(CE7=\"SDD\",OR(CJ7=\"S\",CJ7=\"R\")),\"minE\",IF(AND(CJ7=\"SDD\",OR(CE7=\"S\",CE7=\"R\")),\"minE\",IF(AND(CE7=\"R\",CJ7=\"S\"),\"VME\",IF(AND(CE7=\"S\",CJ7=\"R\"),\"ME\",\"\")))),\"\")","v":""},null,128,{"$f":"IF(AND(CR7<>\"\"),IF(CQ7=\">\",CR7*2,CR7*1),\"\")","v":128},{"$f":"IF((ISNUMBER(CS7)),\nIF(CS7<=4,\"S\",\nIF(CS7=8,\"I\",\nIF(CS7>=16,\"R\", \"\"))),\"\")","v":"R"},{"$f":"IF(ISNUMBER(CS7),ROUND(IMLOG2(CS7),1),\"\")","v":7},null,null,{"$f":"IF(AND(ISNUMBER(CW7)),IF(CV7=\">\",CW7*2,CW7),\"\")","v":""},{"$f":"IF((ISNUMBER(CX7)),\nIF(CX7<=4,\"S\",\nIF(CX7=8,\"I\",\nIF(CX7>=16,\"R\", \"\"))),\"\")","v":""},{"$f":"IF(ISNUMBER(CX7),ROUND(IMLOG2(CX7),1),\"\")","v":""},{"$f":"IF(ISNUMBER(CX7),IF(AND(CQ7=\">\",CX7>=CS7),\"YES\",IF(AND(OR(CV7=\">\",CV7=\">=\"),CS7>CX7),\"YES\",IF(AND(CQ7=\"<=\",CX7<CS7),\"YES\",IF(AND(CV7=\"<=\",CS7<CX7),\"YES\",IF(ABS(CZ7-CU7)<=1,\"YES\",\"NO\"))))),\"\")","v":""},{"$f":"IF(ISNUMBER(CW7),IF(AND(CQ7=\"<=\",CZ7<=CU7), \"No\", IF(AND(CQ7=\"<=\", CV7=\"<=\"), \"No\", IF(AND(CQ7=\">\",CZ7>=CU7), \"No\", IF(AND(CV7=\"<=\", CU7<=CZ7), \"No\", IF(AND(OR(CV7=\">\",CV7=\">=\"),CU7>=CZ7), \"No\", \"yes\"))))),\"\")","v":""},{"$f":"IF(ISNUMBER(CW7),IF(AND(CV7=\"<=\",CQ7=\"<=\"),0,IF(AND(OR(CV7=\">\",CV7=\">=\"),CQ7=\">\"),0,IF(AND(CV7=\"<=\",CU7<CZ7),0, IF(AND(CQ7=\"<=\", CZ7<CU7),0,IF(AND(OR(CQ7=\">\", CQ7=\">=\"),CZ7>CU7),0,IF(AND(OR(CV7=\">\", CV7=\">=\"),CU7>CZ7),0,IF(ISNUMBER(CW7),CZ7-CU7,\"\"))))))),\"\")","v":""},{"$f":"IF(CY7<>\"\",IF(EXACT(CY7,CT7),\"YES\",\"NO\"),\"\")","v":""},{"$f":"IF(CY7<>\"\", IF(AND(CT7=\"I\",OR(CY7=\"S\",CY7=\"R\")),\"minE\",IF(AND(CY7=\"I\",OR(CT7=\"S\",CT7=\"R\")),\"minE\",IF(AND(CT7=\"R\",CY7=\"S\"),\"VME\",IF(AND(CT7=\"S\",CY7=\"R\"),\"ME\",\"\")))),\"\")","v":""},">",64,{"$f":"IF(AND(DG7<>\"\"),IF(DF7=\">\",DG7*2,DG7*1),\"\")","v":128},{"$f":"IF((ISNUMBER(DH7)),\nIF(DH7<=1,\"S\",\nIF(DH7=2,\"I\",\nIF(DH7>=4,\"R\", \"\"))),\"\")","v":"R"},{"$f":"IF(ISNUMBER(DH7),ROUND(IMLOG2(DH7),1),\"\")","v":7},null,null,{"$f":"IF(AND(ISNUMBER(DL7)),IF(DK7=\">\",DL7*2,DL7),\"\")","v":""},{"$f":"IF((ISNUMBER(DM7)),\nIF(DM7<=1,\"S\",\nIF(DM7=2,\"I\",\nIF(DM7>=4,\"R\", \"\"))),\"\")","v":""},{"$f":"IF(ISNUMBER(DM7),ROUND(IMLOG2(DM7),1),\"\")","v":""},{"$f":"IF(ISNUMBER(DM7),IF(AND(DF7=\">\",DM7>=DH7),\"YES\",IF(AND(OR(DK7=\">\",DK7=\">=\"),DH7>DM7),\"YES\",IF(AND(DF7=\"<=\",DM7<DH7),\"YES\",IF(AND(DK7=\"<=\",DH7<DM7),\"YES\",IF(ABS(DO7-DJ7)<=1,\"YES\",\"NO\"))))),\"\")","v":""},{"$f":"IF(ISNUMBER(DL7),IF(AND(DF7=\"<=\",DO7<=DJ7), \"No\", IF(AND(DF7=\"<=\", DK7=\"<=\"), \"No\", IF(AND(DF7=\">\",DO7>=DJ7), \"No\", IF(AND(DK7=\"<=\", DJ7<=DO7), \"No\", IF(AND(OR(DK7=\">\",DK7=\">=\"),DJ7>=DO7), \"No\", \"yes\"))))),\"\")","v":""},{"$f":"IF(ISNUMBER(DL7),IF(AND(DK7=\"<=\",DF7=\"<=\"),0,IF(AND(OR(DK7=\">\",DK7=\">=\"),DF7=\">\"),0,IF(AND(DK7=\"<=\",DJ7<DO7),0, IF(AND(DF7=\"<=\", DO7<DJ7),0,IF(AND(OR(DF7=\">\", DF7=\">=\"),DO7>DJ7),0,IF(AND(OR(DK7=\">\", DK7=\">=\"),DJ7>DO7),0,IF(ISNUMBER(DL7),DO7-DJ7,\"\"))))))),\"\")","v":""},{"$f":"IF(DN7<>\"\",IF(EXACT(DN7,DI7),\"YES\",\"NO\"),\"\")","v":""},{"$f":"IF(DN7<>\"\", IF(AND(DI7=\"I\",OR(DN7=\"S\",DN7=\"R\")),\"minE\",IF(AND(DN7=\"I\",OR(DI7=\"S\",DI7=\"R\")),\"minE\",IF(AND(DI7=\"R\",DN7=\"S\"),\"VME\",IF(AND(DI7=\"S\",DN7=\"R\"),\"ME\",\"\")))),\"\")","v":""},">",32,{"$f":"IF(AND(DV7<>\"\"),IF(DU7=\">\",DV7*2,DV7*1),\"\")","v":64},{"$f":"IF((ISNUMBER(DW7)),\nIF(DW7<=1,\"S\",\nIF(DW7=2,\"I\",\nIF(DW7>=4,\"R\", \"\"))),\"\")","v":"R"},{"$f":"IF(ISNUMBER(DW7),ROUND(IMLOG2(DW7),1),\"\")","v":6},null,null,{"$f":"IF(AND(ISNUMBER(EA7)),IF(DZ7=\">\",EA7*2,EA7),\"\")","v":""},{"$f":"IF((ISNUMBER(EB7)),\nIF(EB7<=1,\"S\",\nIF(EB7=2,\"I\",\nIF(EB7>=4,\"R\", \"\"))),\"\")","v":""},{"$f":"IF(ISNUMBER(EB7),ROUND(IMLOG2(EB7),1),\"\")","v":""},{"$f":"IF(ISNUMBER(EB7),IF(AND(DU7=\">\",EB7>=DW7),\"YES\",IF(AND(OR(DZ7=\">\",DZ7=\">=\"),DW7>EB7),\"YES\",IF(AND(DU7=\"<=\",EB7<DW7),\"YES\",IF(AND(DZ7=\"<=\",DW7<EB7),\"YES\",IF(ABS(ED7-DY7)<=1,\"YES\",\"NO\"))))),\"\")","v":""},{"$f":"IF(ISNUMBER(EA7),IF(AND(DU7=\"<=\",ED7<=DY7), \"No\", IF(AND(DU7=\"<=\", DZ7=\"<=\"), \"No\", IF(AND(DU7=\">\",ED7>=DY7), \"No\", IF(AND(DZ7=\"<=\", DY7<=ED7), \"No\", IF(AND(OR(DZ7=\">\",DZ7=\">=\"),DY7>=ED7), \"No\", \"yes\"))))),\"\")","v":""},{"$f":"IF(ISNUMBER(EA7),IF(AND(DZ7=\"<=\",DU7=\"<=\"),0,IF(AND(OR(DZ7=\">\",DZ7=\">=\"),DU7=\">\"),0,IF(AND(DZ7=\"<=\",DY7<ED7),0, IF(AND(DU7=\"<=\", ED7<DY7),0,IF(AND(OR(DU7=\">\", DU7=\">=\"),ED7>DY7),0,IF(AND(OR(DZ7=\">\", DZ7=\">=\"),DY7>ED7),0,IF(ISNUMBER(EA7),ED7-DY7,\"\"))))))),\"\")","v":""},{"$f":"IF(EC7<>\"\",IF(EXACT(EC7,DX7),\"YES\",\"NO\"),\"\")","v":""},{"$f":"IF(EC7<>\"\", IF(AND(DX7=\"I\",OR(EC7=\"S\",EC7=\"R\")),\"minE\",IF(AND(EC7=\"I\",OR(DX7=\"S\",DX7=\"R\")),\"minE\",IF(AND(DX7=\"R\",EC7=\"S\"),\"VME\",IF(AND(DX7=\"S\",EC7=\"R\"),\"ME\",\"\")))),\"\")","v":""},">",8,{"$f":"IF(AND(EK7<>\"\"),IF(EJ7=\">\",EK7*2,EK7*1),\"\")","v":16},{"$f":"IF((ISNUMBER(EL7)),\nIF(EL7<=0.25,\"S\",\nIF(EL7=0.5,\"I\",\nIF(EL7>=1,\"R\", \"\"))),\"\")","v":"R"},{"$f":"IF(ISNUMBER(EL7),ROUND(IMLOG2(EL7),1),\"\")","v":4},null,null,{"$f":"IF(AND(ISNUMBER(EP7)),IF(EO7=\">\",EP7*2,EP7),\"\")","v":""},{"$f":"IF((ISNUMBER(EQ7)),\nIF(EQ7<=0.25,\"S\",\nIF(EQ7=0.5,\"I\",\nIF(EQ7>=1,\"R\", \"\"))),\"\")","v":""},{"$f":"IF(ISNUMBER(EQ7),ROUND(IMLOG2(EQ7),1),\"\")","v":""},{"$f":"IF(ISNUMBER(EQ7),IF(AND(EJ7=\">\",EQ7>=EL7),\"YES\",IF(AND(OR(EO7=\">\",EO7=\">=\"),EL7>EQ7),\"YES\",IF(AND(EJ7=\"<=\",EQ7<EL7),\"YES\",IF(AND(EO7=\"<=\",EL7<EQ7),\"YES\",IF(ABS(ES7-EN7)<=1,\"YES\",\"NO\"))))),\"\")","v":""},{"$f":"IF(ISNUMBER(EP7),IF(AND(EJ7=\"<=\",ES7<=EN7), \"No\", IF(AND(EJ7=\"<=\", EO7=\"<=\"), \"No\", IF(AND(EJ7=\">\",ES7>=EN7), \"No\", IF(AND(EO7=\"<=\", EN7<=ES7), \"No\", IF(AND(OR(EO7=\">\",EO7=\">=\"),EN7>=ES7), \"No\", \"yes\"))))),\"\")","v":""},{"$f":"IF(ISNUMBER(EP7),IF(AND(EO7=\"<=\",EJ7=\"<=\"),0,IF(AND(OR(EO7=\">\",EO7=\">=\"),EJ7=\">\"),0,IF(AND(EO7=\"<=\",EN7<ES7),0, IF(AND(EJ7=\"<=\", ES7<EN7),0,IF(AND(OR(EJ7=\">\", EJ7=\">=\"),ES7>EN7),0,IF(AND(OR(EO7=\">\", EO7=\">=\"),EN7>ES7),0,IF(ISNUMBER(EP7),ES7-EN7,\"\"))))))),\"\")","v":""},{"$f":"IF(ER7<>\"\",IF(EXACT(ER7,EM7),\"YES\",\"NO\"),\"\")","v":""},{"$f":"IF(ER7<>\"\", IF(AND(EM7=\"I\",OR(ER7=\"S\",ER7=\"R\")),\"minE\",IF(AND(ER7=\"I\",OR(EM7=\"S\",EM7=\"R\")),\"minE\",IF(AND(EM7=\"R\",ER7=\"S\"),\"VME\",IF(AND(EM7=\"S\",ER7=\"R\"),\"ME\",\"\")))),\"\")","v":""},">",8,{"$f":"IF(AND(EZ7<>\"\"),IF(EY7=\">\",EZ7*2,EZ7*1),\"\")","v":16},{"$f":"IF((ISNUMBER(FA7)),\nIF(FA7<=0.5,\"S\",\nIF(FA7=1,\"I\",\nIF(FA7>=2,\"R\", \"\"))),\"\")","v":"R"},{"$f":"IF(ISNUMBER(FA7),ROUND(IMLOG2(FA7),1),\"\")","v":4},null,null,{"$f":"IF(AND(ISNUMBER(FE7)),IF(FD7=\">\",FE7*2,FE7),\"\")","v":""},{"$f":"IF((ISNUMBER(FF7)),\nIF(FF7<=0.5,\"S\",\nIF(FF7=1,\"I\",\nIF(FF7>=2,\"R\", \"\"))),\"\")","v":""},{"$f":"IF(ISNUMBER(FF7),ROUND(IMLOG2(FF7),1),\"\")","v":""},{"$f":"IF(ISNUMBER(FF7),IF(AND(EY7=\">\",FF7>=FA7),\"YES\",IF(AND(OR(FD7=\">\",FD7=\">=\"),FA7>FF7),\"YES\",IF(AND(EY7=\"<=\",FF7<FA7),\"YES\",IF(AND(FD7=\"<=\",FA7<FF7),\"YES\",IF(ABS(FH7-FC7)<=1,\"YES\",\"NO\"))))),\"\")","v":""},{"$f":"IF(ISNUMBER(FE7),IF(AND(EY7=\"<=\",FH7<=FC7), \"No\", IF(AND(EY7=\"<=\", FD7=\"<=\"), \"No\", IF(AND(EY7=\">\",FH7>=FC7), \"No\", IF(AND(FD7=\"<=\", FC7<=FH7), \"No\", IF(AND(OR(FD7=\">\",FD7=\">=\"),FC7>=FH7), \"No\", \"yes\"))))),\"\")","v":""},{"$f":"IF(ISNUMBER(FE7),IF(AND(FD7=\"<=\",EY7=\"<=\"),0,IF(AND(OR(FD7=\">\",FD7=\">=\"),EY7=\">\"),0,IF(AND(FD7=\"<=\",FC7<FH7),0, IF(AND(EY7=\"<=\", FH7<FC7),0,IF(AND(OR(EY7=\">\", EY7=\">=\"),FH7>FC7),0,IF(AND(OR(FD7=\">\", FD7=\">=\"),FC7>FH7),0,IF(ISNUMBER(FE7),FH7-FC7,\"\"))))))),\"\")","v":""},{"$f":"IF(FG7<>\"\",IF(EXACT(FG7,FB7),\"YES\",\"NO\"),\"\")","v":""},{"$f":"IF(FG7<>\"\", IF(AND(FB7=\"I\",OR(FG7=\"S\",FG7=\"R\")),\"minE\",IF(AND(FG7=\"I\",OR(FB7=\"S\",FB7=\"R\")),\"minE\",IF(AND(FB7=\"R\",FG7=\"S\"),\"VME\",IF(AND(FB7=\"S\",FG7=\"R\"),\"ME\",\"\")))),\"\")","v":""}]
[null,null,"AR0002","Enterobacter cloacae",">",8,16,{"$f":"IF((ISNUMBER(G8)),\nIF(G8<=0.5,\"S\",\nIF(G8=1,\"I\",\nIF(G8>=2,\"R\", \"\"))),\"\")","v":"R"},4,null,null,{"$f":"IF(AND(ISNUMBER(K8)),IF(J8=\">\",K8*2,K8),\"\")","v":""},{"$f":"IF((ISNUMBER(L8)),\nIF(L8<=0.5,\"S\",\nIF(L8=1,\"I\",\nIF(L8>=2,\"R\", \"\"))),\"\")","v":""},"","","","","","",">",8,16,{"$f":"IF((ISNUMBER(V8)),\nIF(V8<=1,\"S\",\nIF(V8=2,\"I\",\nIF(V8>=4,\"R\", \"\"))),\"\")","v":"R"},4,null,null,{"$f":"IF(AND(ISNUMBER(Z8)),IF(Y8=\">\",Z8*2,Z8),\"\")","v":""},{"$f":"IF((ISNUMBER(AA8)),\nIF(AA8<=1,\"S\",\nIF(AA8=2,\"I\",\nIF(AA8>=4,\"R\", \"\"))),\"\")","v":""},"",{"$f":"IF(ISNUMBER(AA8),IF(AND(T8=\">\",AA8>=V8),\"YES\",IF(AND(OR(Y8=\">\",Y8=\">=\"),V8>AA8),\"YES\",IF(AND(T8=\"<=\",AA8<V8),\"YES\",IF(AND(Y8=\"<=\",V8<AA8),\"YES\",IF(ABS(AC8-X8)<=1,\"YES\",\"NO\"))))),\"\")","v":""},"","","","",null,16,16,{"$f":"IF((ISNUMBER(AK8)),\nIF(AK8<=1,\"S\",\nIF(AK8=2,\"I\",\nIF(AK8>=4,\"R\", \"\"))),\"\")","v":"R"},4,null,null,{"$f":"IF(AND(ISNUMBER(AO8)),IF(AN8=\">\",AO8*2,AO8),\"\")","v":""},{"$f":"IF((ISNUMBER(AP8)),\nIF(AP8<=1,\"S\",\nIF(AP8=2,\"I\",\nIF(AP8>=4,\"R\", \"\"))),\"\")","v":""},"",{"$f":"IF(ISNUMBER(AP8),IF(AND(AI8=\">\",AP8>=AK8),\"YES\",IF(AND(OR(AN8=\">\",AN8=\">=\"),AK8>AP8),\"YES\",IF(AND(AI8=\"<=\",AP8<AK8),\"YES\",IF(AND(AN8=\"<=\",AK8<AP8),\"YES\",IF(ABS(AR8-AM8)<=1,\"YES\",\"NO\"))))),\"\")","v":""},"","","","",null,null,"",null,"",null,null,null,null,null,null,null,null,null,null,">",64,128,{"$f":"IF((ISNUMBER(BO8)),\nIF(BO8<=4,\"S\",\nIF(BO8=8,\"I\",\nIF(BO8>=16,\"R\", \"\"))),\"\")","v":"R"},7,null,null,{"$f":"IF(AND(ISNUMBER(BS8)),IF(BR8=\">\",BS8*2,BS8),\"\")","v":""},{"$f":"IF((ISNUMBER(BT8)),\nIF(BT8<=4,\"S\",\nIF(BT8=8,\"I\",\nIF(BT8>=16,\"R\", \"\"))),\"\")","v":""},"",{"$f":"IF(ISNUMBER(BT8),IF(AND(BM8=\">\",BT8>=BO8),\"YES\",IF(AND(OR(BR8=\">\",BR8=\">=\"),BO8>BT8),\"YES\",IF(AND(BM8=\"<=\",BT8<BO8),\"YES\",IF(AND(BR8=\"<=\",BO8<BT8),\"YES\",IF(ABS(BV8-BQ8)<=1,\"YES\",\"NO\"))))),\"\")","v":""},"","","","",">",32,64,{"$f":"IF((ISNUMBER(CD8)),\nIF(CD8<=2,\"S\",\nIF(OR(CD8=8, CD8=4),\"SDD\",\nIF(CD8>=16,\"R\", \"\"))),\"\")","v":"R"},6,null,null,{"$f":"IF(AND(ISNUMBER(CH8)),IF(CG8=\">\",CH8*2,CH8),\"\")","v":""},{"$f":"IF((ISNUMBER(CI8)),\nIF(CI8<=2,\"S\",\nIF(OR(CI8=8, CI8=4),\"SDD\",\nIF(CI8>=16,\"R\", \"\"))),\"\")","v":""},"",{"$f":"IF(ISNUMBER(CI8),IF(AND(CB8=\">\",CI8>=CD8),\"YES\",IF(AND(OR(CG8=\">\",CG8=\">=\"),CD8>CI8),\"YES\",IF(AND(CB8=\"<=\",CI8<CD8),\"YES\",IF(AND(CG8=\"<=\",CD8<CI8),\"YES\",IF(ABS(CK8-CF8)<=1,\"YES\",\"NO\"))))),\"\")","v":""},"","","","",">",128,256,{"$f":"IF((ISNUMBER(CS8)),\nIF(CS8<=4,\"S\",\nIF(CS8=8,\"I\",\nIF(CS8>=16,\"R\", \"\"))),\"\")","v":"R"},8,null,null,{"$f":"IF(AND(ISNUMBER(CW8)),IF(CV8=\">\",CW8*2,CW8),\"\")","v":""},{"$f":"IF((ISNUMBER(CX8)),\nIF(CX8<=4,\"S\",\nIF(CX8=8,\"I\",\nIF(CX8>=16,\"R\", \"\"))),\"\")","v":""},"",{"$f":"IF(ISNUMBER(CX8),IF(AND(CQ8=\">\",CX8>=CS8),\"YES\",IF(AND(OR(CV8=\">\",CV8=\">=\"),CS8>CX8),\"YES\",IF(AND(CQ8=\"<=\",CX8<CS8),\"YES\",IF(AND(CV8=\"<=\",CS8<CX8),\"YES\",IF(ABS(CZ8-CU8)<=1,\"YES\",\"NO\"))))),\"\")","v":""},"","","","",">",64,128,{"$f":"IF((ISNUMBER(DH8)),\nIF(DH8<=1,\"S\",\nIF(DH8=2,\"I\",\nIF(DH8>=4,\"R\", \"\"))),\"\")","v":"R"},7,null,null,{"$f":"IF(AND(ISNUMBER(DL8)),IF(DK8=\">\",DL8*2,DL8),\"\")","v":""},{"$f":"IF((ISNUMBER(DM8)),\nIF(DM8<=1,\"S\",\nIF(DM8=2,\"I\",\nIF(DM8>=4,\"R\", \"\"))),\"\")","v":""},"",{"$f":"IF(ISNUMBER(DM8),IF(AND(DF8=\">\",DM8>=DH8),\"YES\",IF(AND(OR(DK8=\">\",DK8=\">=\"),DH8>DM8),\"YES\",IF(AND(DF8=\"<=\",DM8<DH8),\"YES\",IF(AND(DK8=\"<=\",DH8<DM8),\"YES\",IF(ABS(DO8-DJ8)<=1,\"YES\",\"NO\"))))),\"\")","v":""},"","","","",">",32,64,{"$f":"IF((ISNUMBER(DW8)),\nIF(DW8<=1,\"S\",\nIF(DW8=2,\"I\",\nIF(DW8>=4,\"R\", \"\"))),\"\")","v":"R"},6,null,null,{"$f":"IF(AND(ISNUMBER(EA8)),IF(DZ8=\">\",EA8*2,EA8),\"\")","v":""},{"$f":"IF((ISNUMBER(EB8)),\nIF(EB8<=1,\"S\",\nIF(EB8=2,\"I\",\nIF(EB8>=4,\"R\", \"\"))),\"\")","v":""},"",{"$f":"IF(ISNUMBER(EB8),IF(AND(DU8=\">\",EB8>=DW8),\"YES\",IF(AND(OR(DZ8=\">\",DZ8=\">=\"),DW8>EB8),\"YES\",IF(AND(DU8=\"<=\",EB8<DW8),\"YES\",IF(AND(DZ8=\"<=\",DW8<EB8),\"YES\",IF(ABS(ED8-DY8)<=1,\"YES\",\"NO\"))))),\"\")","v":""},"","","","",">",8,16,{"$f":"IF((ISNUMBER(EL8)),\nIF(EL8<=0.25,\"S\",\nIF(EL8=0.5,\"I\",\nIF(EL8>=1,\"R\", \"\"))),\"\")","v":"R"},4,null,null,{"$f":"IF(AND(ISNUMBER(EP8)),IF(EO8=\">\",EP8*2,EP8),\"\")","v":""},{"$f":"IF((ISNUMBER(EQ8)),\nIF(EQ8<=0.25,\"S\",\nIF(EQ8=0.5,\"I\",\nIF(EQ8>=1,\"R\", \"\"))),\"\")","v":""},"",{"$f":"IF(ISNUMBER(EQ8),IF(AND(EJ8=\">\",EQ8>=EL8),\"YES\",IF(AND(OR(EO8=\">\",EO8=\">=\"),EL8>EQ8),\"YES\",IF(AND(EJ8=\"<=\",EQ8<EL8),\"YES\",IF(AND(EO8=\"<=\",EL8<EQ8),\"YES\",IF(ABS(ES8-EN8)<=1,\"YES\",\"NO\"))))),\"\")","v":""},"","","","",">",8,16,{"$f":"IF((ISNUMBER(FA8)),\nIF(FA8<=0.5,\"S\",\nIF(FA8=1,\"I\",\nIF(FA8>=2,\"R\", \"\"))),\"\")","v":"R"},4,null,null,{"$f":"IF(AND(ISNUMBER(FE8)),IF(FD8=\">\",FE8*2,FE8),\"\")","v":""},{"$f":"IF((ISNUMBER(FF8)),\nIF(FF8<=0.5,\"S\",\nIF(FF8=1,\"I\",\nIF(FF8>=2,\"R\", \"\"))),\"\")","v":""},"",{"$f":"IF(ISNUMBER(FF8),IF(AND(EY8=\">\",FF8>=FA8),\"YES\",IF(AND(OR(FD8=\">\",FD8=\">=\"),FA8>FF8),\"YES\",IF(AND(EY8=\"<=\",FF8<FA8),\"YES\",IF(AND(FD8=\"<=\",FA8<FF8),\"YES\",IF(ABS(FH8-FC8)<=1,\"YES\",\"NO\"))))),\"\")","v":""},"","","",""]
[null,null,"AR0003","Klebsiella pneumoniae",">",8,16,"R",4,null,null,"","","","","","","","",">",8,16,"R",4,null,null,"","","","","","","","",null,8,8,"R",3,null,null,"","","","","","","","",">",8,16,{"$f":"IF((ISNUMBER(AZ9)),\nIF(AZ9<=2,\"S\",\nIF(AZ9=4,\"I\",\nIF(AZ9>=8,\"R\", \"\"))),\"\")","v":"R"},4,null,null,{"$f":"IF(AND(ISNUMBER(BD9)),IF(BC9=\">\",BD9*2,BD9),\"\")","v":""},{"$f":"IF((ISNUMBER(BE9)),\nIF(BE9<=2,\"S\",\nIF(BE9=4,\"I\",\nIF(BE9>=8,\"R\", \"\"))),\"\")","v":""},"",{"$f":"IF(ISNUMBER(BE9),IF(AND(AX9=\">\",BE9>=AZ9),\"YES\",IF(AND(OR(BC9=\">\",BC9=\">=\"),AZ9>BE9),\"YES\",IF(AND(AX9=\"<=\",BE9<AZ9),\"YES\",IF(AND(BC9=\"<=\",AZ9<BE9),\"YES\",IF(ABS(BG9-BB9)<=1,\"YES\",\"NO\"))))),\"\")","v":""},"","",{"$f":"IF(BF9<>\"\",IF(EXACT(BF9,BA9),\"YES\",\"NO\"),\"\")","v":""},{"$f":"IF(BF9<>\"\", IF(AND(BA9=\"I\",OR(BF9=\"S\",BF9=\"R\")),\"minE\",IF(AND(BF9=\"I\",OR(BA9=\"S\",BA9=\"R\")),\"minE\",IF(AND(BA9=\"R\",BF9=\"S\"),\"VME\",IF(AND(BA9=\"S\",BF9=\"R\"),\"ME\",\"\")))),\"\")","v":""},">",64,128,"R",7,null,null,"","","","","","","","",">",32,64,"R",6,null,null,"","","","","","","","",">",128,256,"R",8,null,null,"","","","","","","","",">",128,256,"R",8,null,null,"","","","","","","","",">",32,64,"R",6,null,null,"","","","","","","","",">",8,16,"R",4,null,null,"","","","","","","","",">",8,16,"R",4,null,null,"","","","","","","",""]
[null,null,"AR0004","Klebsiella pneumoniae",">",8,16,"R",4,null,null,"","","","","","","","",">",8,16,"R",4,null,null,"","","","","","","","",null,16,16,"R",4,null,null,"","","","","","","","",">",8,16,"R",4,null,null,"","","","","","",{"$f":"IF(BF10<>\"\",IF(EXACT(BF10,BA10),\"YES\",\"NO\"),\"\")","v":""},{"$f":"IF(BF10<>\"\", IF(AND(BA10=\"I\",OR(BF10=\"S\",BF10=\"R\")),\"minE\",IF(AND(BF10=\"I\",OR(BA10=\"S\",BA10=\"R\")),\"minE\",IF(AND(BA10=\"R\",BF10=\"S\"),\"VME\",IF(AND(BA10=\"S\",BF10=\"R\"),\"ME\",\"\")))),\"\")","v":""},">",64,128,"R",7,null,null,"","","","","","","","",">",32,64,"R",6,null,null,"","","","","","","","",">",128,256,"R",8,null,null,"","","","","","","","",">",128,256,"R",8,null,null,"","","","","","","","",">",32,64,"R",6,null,null,"","","","","","","","",">",8,16,"R",4,null,null,"","","","","","","","",">",8,16,"R",4,null,null,"","","","","","","",""]
[null,null,"AR0005","Klebsiella pneumoniae",">",8,16,"R",4,null,null,"","","","","","","","",">",8,16,"R",4,null,null,"","","","","","","","",null,16,16,"R",4,null,null,"","","","","","","","",">",8,16,"R",4,null,null,"","","","","","",{"$f":"IF(BF11<>\"\",IF(EXACT(BF11,BA11),\"YES\",\"NO\"),\"\")","v":""},{"$f":"IF(BF11<>\"\", IF(AND(BA11=\"I\",OR(BF11=\"S\",BF11=\"R\")),\"minE\",IF(AND(BF11=\"I\",OR(BA11=\"S\",BA11=\"R\")),\"minE\",IF(AND(BA11=\"R\",BF11=\"S\"),\"VME\",IF(AND(BA11=\"S\",BF11=\"R\"),\"ME\",\"\")))),\"\")","v":""},">",64,128,"R",7,null,null,"","","","","","","","",">",32,64,"R",6,null,null,"","","","","","","","",">",128,256,"R",8,null,null,"","","","","","","","",">",128,256,"R",8,null,null,"","","","","","","","",">",32,64,"R",6,null,null,"","","","","","","","",">",8,16,"R",4,null,null,"","","","","","","","",">",8,16,"R",4,null,null,"","","","","","","",""]
[null,null,"AR0006","Escherichia coli",">",8,16,"R",4,null,null,"","","","","","","","",null,8,8,"R",3,null,null,"","","","","","","","",null,16,16,"R",4,null,null,"","","","","","","","",">",8,16,"R",4,null,null,"","","","","","",{"$f":"IF(BF12<>\"\",IF(EXACT(BF12,BA12),\"YES\",\"NO\"),\"\")","v":""},{"$f":"IF(BF12<>\"\", IF(AND(BA12=\"I\",OR(BF12=\"S\",BF12=\"R\")),\"minE\",IF(AND(BF12=\"I\",OR(BA12=\"S\",BA12=\"R\")),\"minE\",IF(AND(BA12=\"R\",BF12=\"S\"),\"VME\",IF(AND(BA12=\"S\",BF12=\"R\"),\"ME\",\"\")))),\"\")","v":""},">",64,128,"R",7,null,null,"","","","","","","","",">",32,64,"R",6,null,null,"","","","","","","","",">",128,256,"R",8,null,null,"","","","","","","","",">",128,256,"R",8,null,null,"","","","","","","","",">",32,64,"R",6,null,null,"","","","","","","","",">",8,16,"R",4,null,null,"","","","","","","","",">",8,16,"R",4,null,null,"","","","","","","",""]
[null,null,"AR0007","Klebsiella aerogenes",null,2,2,"R",1,null,null,"","","","","","","","",null,2,2,"I",1,null,null,"","","","","","","","",null,1,1,"S",0,null,null,"","","","","","","","",null,null,"",null,"",null,null,null,null,null,null,null,null,null,null,null,64,64,"R",6,null,null,"","","","","","","","",null,32,32,"R",5,null,null,"","","","","","","","",">",128,256,"R",8,null,null,"","","","","","","","",null,64,64,"R",6,null,null,"","","","","","","","",">",32,64,"R",6,null,null,"","","","","","","","",">",8,16,"R",4,null,null,"","","","","","","","",">",8,16,"R",4,null,null,"","","","","","","",""]
[null,null,"AR0008","Enterobacter cloacae",">",8,16,"R",4,null,null,"","","","","","","","",null,2,2,"I",1,null,null,"","","","","","","","",null,1,1,"S",0,null,null,"","","","","","","","",null,null,"",null,"",null,null,null,null,null,null,null,null,null,null,null,64,64,"R",6,null,null,"","","","","","","","",null,8,8,"SDD",3,null,null,"","","","","","","","",null,128,128,"R",7,null,null,"","","","","","","","",">",128,256,"R",8,null,null,"","","","","","","","",null,32,32,"R",5,null,null,"","","","","","","","",">",8,16,"R",4,null,null,"","","","","","","","",">",8,16,"R",4,null,null,"","","","","","","",""]
[null,null,"AR0009","Klebsiella aerogenes",">",8,16,"R",4,null,null,"","","","","","","","",null,2,2,"I",1,null,null,"","","","","","","","",null,8,8,"R",3,null,null,"","","","","","","","",null,null,"",null,"",null,null,null,null,null,null,null,null,null,null,null,64,64,"R",6,null,null,"","","","","","","","",null,2,2,"S",1,null,null,"","","","","","","","",null,128,128,"R",7,null,null,"","","","","","","","",null,128,128,"R",7,null,null,"","","","","","","","",">",32,64,"R",6,null,null,"","","","","","","","","<=",0.25,0.25,"S",-2,null,null,"","","","","","","","","<=",0.25,0.25,"S",-2,null,null,"","","","","","","",""]
[null,null,"AR0010","Klebsiella pneumoniae",">",8,16,"R",4,null,null,"","","","","","","","",null,1,1,"S",0,null,null,"","","","","","","","",null,4,4,"R",2,null,null,"","","","","","","","",">",8,16,{"$f":"IF((ISNUMBER(AZ16)),\nIF(AZ16<=2,\"S\",\nIF(AZ16=4,\"I\",\nIF(AZ16>=8,\"R\", \"\"))),\"\")","v":"R"},4,null,null,"",{"$f":"IF((ISNUMBER(BE16)),\nIF(BE16<=2,\"S\",\nIF(BE16=4,\"I\",\nIF(BE16>=8,\"R\", \"\"))),\"\")","v":""},"","","","",{"$f":"IF(BF16<>\"\",IF(EXACT(BF16,BA16),\"YES\",\"NO\"),\"\")","v":""},{"$f":"IF(BF16<>\"\", IF(AND(BA16=\"I\",OR(BF16=\"S\",BF16=\"R\")),\"minE\",IF(AND(BF16=\"I\",OR(BA16=\"S\",BA16=\"R\")),\"minE\",IF(AND(BA16=\"R\",BF16=\"S\"),\"VME\",IF(AND(BA16=\"S\",BF16=\"R\"),\"ME\",\"\")))),\"\")","v":""},null,32,32,"R",5,null,null,"","","","","","","","",null,8,8,"SDD",3,null,null,"","","","","","","","",">",128,256,"R",8,null,null,"","","","","","","","",null,128,128,"R",7,null,null,"","","","","","","","",">",32,64,"R",6,null,null,"","","","","","","","","<=",0.25,0.25,"S",-2,null,null,"","","","","","","","","<=",0.125,0.125,"S",-3,null,null,"","","","","","","",""]
[null,null,"AR0011","Escherichia coli",null,0.25,0.25,"S",-2,null,null,"","","","","","","","","<=",0.125,0.125,"S",-3,null,null,"","","","","","","","","<=",0.5,0.5,"S",-1,null,null,"","","","","","","","",">",8,16,"R",4,null,null,"","","","","","","","",">",64,128,"R",7,null,null,"","","","","","","","",">",32,64,"R",6,null,null,"","","","","","","","",null,128,128,"R",7,null,null,"","","","","","","","",">",128,256,"R",8,null,null,"","","","","","","","",">",32,64,"R",6,null,null,"","","","","","","","",">",8,16,"R",4,null,null,"","","","","","","","",">",8,16,"R",4,null,null,"","","","","","","",""]
[null,null,"AR0012","Klebsiella pneumoniae",null,0.5,0.5,"S",-1,null,null,"","","","","","","","","<=",0.125,0.125,"S",-3,null,null,"","","","","","","","","<=",0.5,0.5,"S",-1,null,null,"","","","","","","","",">",8,16,"R",4,null,null,"","","","","","","","",">",64,128,"R",7,null,null,"","","","","","","","",">",32,64,"R",6,null,null,"","","","","","","","",">",128,256,"R",8,null,null,"","","","","","","","",">",128,256,"R",8,null,null,"","","","","","","","",">",32,64,"R",6,null,null,"","","","","","","","",">",8,16,"R",4,null,null,"","","","","","","","",">",8,16,"R",4,null,null,"","","","","","","",""]
[null,null,"AR0013","Escherichia coli","<=",0.125,0.125,"S",-3,null,null,"","","","","","","","","<=",0.125,0.125,"S",-3,null,null,"","","","","","","","","<=",0.5,0.5,"S",-1,null,null,"","","","","","","","",">",8,16,"R",4,null,null,"","","","","",{"$f":"IF(ISNUMBER(BD19),IF(AND(BC19=\"<=\",AX19=\"<=\"),0,IF(AND(OR(BC19=\">\",BC19=\">=\"),AX19=\">\"),0,IF(AND(BC19=\"<=\",BB19<BG19),0, IF(AND(AX19=\"<=\", BG19<BB19),0,IF(AND(OR(AX19=\">\", AX19=\">=\"),BG19>BB19),0,IF(AND(OR(BC19=\">\", BC19=\">=\"),BB19>BG19),0,IF(ISNUMBER(BD19),BG19-BB19,\"\"))))))),\"\")","v":""},"","","<=",2,2,"S",1,null,null,"","","","","",{"$f":"IF(ISNUMBER(BS19),IF(AND(BR19=\"<=\",BM19=\"<=\"),0,IF(AND(OR(BR19=\">\",BR19=\">=\"),BM19=\">\"),0,IF(AND(BR19=\"<=\",BQ19<BV19),0, IF(AND(BM19=\"<=\", BV19<BQ19),0,IF(AND(OR(BM19=\">\", BM19=\">=\"),BV19>BQ19),0,IF(AND(OR(BR19=\">\", BR19=\">=\"),BQ19>BV19),0,IF(ISNUMBER(BS19),BV19-BQ19,\"\"))))))),\"\")","v":""},"","",null,4,4,"SDD",2,null,null,"","","","","",{"$f":"IF(ISNUMBER(CH19),IF(AND(CG19=\"<=\",CB19=\"<=\"),0,IF(AND(OR(CG19=\">\",CG19=\">=\"),CB19=\">\"),0,IF(AND(CG19=\"<=\",CF19<CK19),0, IF(AND(CB19=\"<=\", CK19<CF19),0,IF(AND(OR(CB19=\">\", CB19=\">=\"),CK19>CF19),0,IF(AND(OR(CG19=\">\", CG19=\">=\"),CF19>CK19),0,IF(ISNUMBER(CH19),CK19-CF19,\"\"))))))),\"\")","v":""},"","","<=",1,1,"S",0,null,null,"","","","","",{"$f":"IF(ISNUMBER(CW19),IF(AND(CV19=\"<=\",CQ19=\"<=\"),0,IF(AND(OR(CV19=\">\",CV19=\">=\"),CQ19=\">\"),0,IF(AND(CV19=\"<=\",CU19<CZ19),0, IF(AND(CQ19=\"<=\", CZ19<CU19),0,IF(AND(OR(CQ19=\">\", CQ19=\">=\"),CZ19>CU19),0,IF(AND(OR(CV19=\">\", CV19=\">=\"),CU19>CZ19),0,IF(ISNUMBER(CW19),CZ19-CU19,\"\"))))))),\"\")","v":""},"","",">",64,128,"R",7,null,null,"","","","","",{"$f":"IF(ISNUMBER(DL19),IF(AND(DK19=\"<=\",DF19=\"<=\"),0,IF(AND(OR(DK19=\">\",DK19=\">=\"),DF19=\">\"),0,IF(AND(DK19=\"<=\",DJ19<DO19),0, IF(AND(DF19=\"<=\", DO19<DJ19),0,IF(AND(OR(DF19=\">\", DF19=\">=\"),DO19>DJ19),0,IF(AND(OR(DK19=\">\", DK19=\">=\"),DJ19>DO19),0,IF(ISNUMBER(DL19),DO19-DJ19,\"\"))))))),\"\")","v":""},"","",">",32,64,"R",6,null,null,"","","","","",{"$f":"IF(ISNUMBER(EA19),IF(AND(DZ19=\"<=\",DU19=\"<=\"),0,IF(AND(OR(DZ19=\">\",DZ19=\">=\"),DU19=\">\"),0,IF(AND(DZ19=\"<=\",DY19<ED19),0, IF(AND(DU19=\"<=\", ED19<DY19),0,IF(AND(OR(DU19=\">\", DU19=\">=\"),ED19>DY19),0,IF(AND(OR(DZ19=\">\", DZ19=\">=\"),DY19>ED19),0,IF(ISNUMBER(EA19),ED19-DY19,\"\"))))))),\"\")","v":""},"","","<=",0.25,0.25,"S",-2,null,null,"","","","","",{"$f":"IF(ISNUMBER(EP19),IF(AND(EO19=\"<=\",EJ19=\"<=\"),0,IF(AND(OR(EO19=\">\",EO19=\">=\"),EJ19=\">\"),0,IF(AND(EO19=\"<=\",EN19<ES19),0, IF(AND(EJ19=\"<=\", ES19<EN19),0,IF(AND(OR(EJ19=\">\", EJ19=\">=\"),ES19>EN19),0,IF(AND(OR(EO19=\">\", EO19=\">=\"),EN19>ES19),0,IF(ISNUMBER(EP19),ES19-EN19,\"\"))))))),\"\")","v":""},"","","<=",0.25,0.25,"S",-2,null,null,"","","","","",{"$f":"IF(ISNUMBER(FE19),IF(AND(FD19=\"<=\",EY19=\"<=\"),0,IF(AND(OR(FD19=\">\",FD19=\">=\"),EY19=\">\"),0,IF(AND(FD19=\"<=\",FC19<FH19),0, IF(AND(EY19=\"<=\", FH19<FC19),0,IF(AND(OR(EY19=\">\", EY19=\">=\"),FH19>FC19),0,IF(AND(OR(FD19=\">\", FD19=\">=\"),FC19>FH19),0,IF(ISNUMBER(FE19),FH19-FC19,\"\"))))))),\"\")","v":""},"",""]
[null,null,"AR0014","Escherichia coli","<=",0.125,0.125,"S",-3,null,null,"","","","","","","","","<=",0.125,0.125,"S",-3,null,null,"","","","","","","","","<=",0.5,0.5,"S",-1,null,null,"","","","","","","","",">",8,16,"R",4,null,null,"","","","","","","","",null,64,64,"R",6,null,null,"","","","","","","","",">",32,64,"R",6,null,null,"","","","","",{"$f":"IF(ISNUMBER(CH20),IF(AND(CG20=\"<=\",CB20=\"<=\"),0,IF(AND(OR(CG20=\">\",CG20=\">=\"),CB20=\">\"),0,IF(AND(CG20=\"<=\",CF20<CK20),0, IF(AND(CB20=\"<=\", CK20<CF20),0,IF(AND(OR(CB20=\">\", CB20=\">=\"),CK20>CF20),0,IF(AND(OR(CG20=\">\", CG20=\">=\"),CF20>CK20),0,IF(ISNUMBER(CH20),CK20-CF20,\"\"))))))),\"\")","v":""},"","",null,32,32,"R",5,null,null,"","","","","",{"$f":"IF(ISNUMBER(CW20),IF(AND(CV20=\"<=\",CQ20=\"<=\"),0,IF(AND(OR(CV20=\">\",CV20=\">=\"),CQ20=\">\"),0,IF(AND(CV20=\"<=\",CU20<CZ20),0, IF(AND(CQ20=\"<=\", CZ20<CU20),0,IF(AND(OR(CQ20=\">\", CQ20=\">=\"),CZ20>CU20),0,IF(AND(OR(CV20=\">\", CV20=\">=\"),CU20>CZ20),0,IF(ISNUMBER(CW20),CZ20-CU20,\"\"))))))),\"\")","v":""},"","",">",128,256,"R",8,null,null,"","","","","",{"$f":"IF(ISNUMBER(DL20),IF(AND(DK20=\"<=\",DF20=\"<=\"),0,IF(AND(OR(DK20=\">\",DK20=\">=\"),DF20=\">\"),0,IF(AND(DK20=\"<=\",DJ20<DO20),0, IF(AND(DF20=\"<=\", DO20<DJ20),0,IF(AND(OR(DF20=\">\", DF20=\">=\"),DO20>DJ20),0,IF(AND(OR(DK20=\">\", DK20=\">=\"),DJ20>DO20),0,IF(ISNUMBER(DL20),DO20-DJ20,\"\"))))))),\"\")","v":""},"","",">",32,64,"R",6,null,null,"","","","","",{"$f":"IF(ISNUMBER(EA20),IF(AND(DZ20=\"<=\",DU20=\"<=\"),0,IF(AND(OR(DZ20=\">\",DZ20=\">=\"),DU20=\">\"),0,IF(AND(DZ20=\"<=\",DY20<ED20),0, IF(AND(DU20=\"<=\", ED20<DY20),0,IF(AND(OR(DU20=\">\", DU20=\">=\"),ED20>DY20),0,IF(AND(OR(DZ20=\">\", DZ20=\">=\"),DY20>ED20),0,IF(ISNUMBER(EA20),ED20-DY20,\"\"))))))),\"\")","v":""},"","",">",8,16,"R",4,null,null,"","","","","",{"$f":"IF(ISNUMBER(EP20),IF(AND(EO20=\"<=\",EJ20=\"<=\"),0,IF(AND(OR(EO20=\">\",EO20=\">=\"),EJ20=\">\"),0,IF(AND(EO20=\"<=\",EN20<ES20),0, IF(AND(EJ20=\"<=\", ES20<EN20),0,IF(AND(OR(EJ20=\">\", EJ20=\">=\"),ES20>EN20),0,IF(AND(OR(EO20=\">\", EO20=\">=\"),EN20>ES20),0,IF(ISNUMBER(EP20),ES20-EN20,\"\"))))))),\"\")","v":""},"","",">",8,16,"R",4,null,null,"","","","","",{"$f":"IF(ISNUMBER(FE20),IF(AND(FD20=\"<=\",EY20=\"<=\"),0,IF(AND(OR(FD20=\">\",FD20=\">=\"),EY20=\">\"),0,IF(AND(FD20=\"<=\",FC20<FH20),0, IF(AND(EY20=\"<=\", FH20<FC20),0,IF(AND(OR(EY20=\">\", EY20=\">=\"),FH20>FC20),0,IF(AND(OR(FD20=\">\", FD20=\">=\"),FC20>FH20),0,IF(ISNUMBER(FE20),FH20-FC20,\"\"))))))),\"\")","v":""},"",""]
[null,null,"AR0015","Escherichia coli",null,0.5,0.5,"S",-1,null,null,"","","","","","","","","<=",0.125,0.125,"S",-3,null,null,"","","","","","","","","<=",0.5,0.5,"S",-1,null,null,"","","","","","","","",">",8,16,"R",4,null,null,"","","","","","","","",">",64,128,"R",7,null,null,"","","","","","","","",">",32,64,"R",6,null,null,"","","","","","","","",null,64,64,"R",6,null,null,"","","","","","","","",">",128,256,"R",8,null,null,"","","","","","","","",">",32,64,"R",6,null,null,"","","","","","","","",">",8,16,"R",4,null,null,"","","","","","","","",">",8,16,"R",4,null,null,"","","","","","","",""]
[null,null,"AR0016","Klebsiella pneumoniae","<=",0.125,0.125,"S",-3,null,null,"","","","","","","","","<=",0.125,0.125,"S",-3,null,null,"","","","","","","","","<=",0.5,0.5,"S",-1,null,null,"","","","","","","","",null,4,4,"I",2,null,null,"","","","","","","","","<=",2,2,"S",1,null,null,"","","","","","","","","<=",0.5,0.5,"S",-1,null,null,"","","","","","","","","<=",1,1,"S",0,null,null,"","","","","","","","","<=",0.5,0.5,"S",-1,null,null,"","","","","","","","","<=",1,1,"S",0,null,null,"","","","","","","","","<=",0.25,0.25,"S",-2,null,null,"","","","","","","","",null,0.5,0.5,"S",-1,null,null,"","","","","","","",""]
[null,null,"AR0017","Escherichia coli","<=",0.125,0.125,"S",-3,null,null,"","","","","","","","","<=",0.125,0.125,"S",-3,null,null,"","","","","","","","","<=",0.5,0.5,"S",-1,null,null,"","","","","","","","",null,2,2,"S",1,null,null,"","","","","","","","","<=",2,2,"S",1,null,null,"","","","","","","","","<=",0.5,0.5,"S",-1,null,null,"","","","","","","","","<=",1,1,"S",0,null,null,"","","","","","","","","<=",1,1,"S",0,null,null,"","","","","","","","","<=",1,1,"S",0,null,null,"","","","","","","","","<=",0.25,0.25,"S",-2,null,null,"","","","","","","","","<=",0.25,0.25,"S",-2,null,null,"","","","","","","",""]
[null,null,"AR0018","Klebsiella aerogenes","<=",0.125,0.125,"S",-3,null,null,"","","","","","","","","<=",0.125,0.125,"S",-3,null,null,"","","","","","","","",null,1,1,"S",0,null,null,"","","","","","","","",null,null,null,null,null,null,null,null,null,null,null,null,null,null,null,"<=",2,2,"S",1,null,null,"","","","","","","","","<=",0.5,0.5,"S",-1,null,null,"","","","","","","","","<=",1,1,"S",0,null,null,"","","","","","","","","<=",1,1,"S",0,null,null,"","","","","","","","","<=",1,1,"S",0,null,null,"","","","","","","","","<=",0.25,0.25,"S",-2,null,null,"","","","","","","","","<=",0.25,0.25,"S",-2,null,null,"","","","","","","",""]
[null,null,"AR0019","Escherichia coli","<=",0.125,0.125,"S",-3,null,null,"","","","","","","","","<=",0.125,0.125,"S",-3,null,null,"","","","","","","","","<=",0.5,0.5,"S",-1,null,null,"","","","","","","","",null,8,8,{"$f":"IF((ISNUMBER(AZ25)),\nIF(AZ25<=2,\"S\",\nIF(AZ25=4,\"I\",\nIF(AZ25>=8,\"R\", \"\"))),\"\")","v":"R"},3,null,null,"",{"$f":"IF((ISNUMBER(BE25)),\nIF(BE25<=2,\"S\",\nIF(BE25=4,\"I\",\nIF(BE25>=8,\"R\", \"\"))),\"\")","v":""},"","","","",{"$f":"IF(BF25<>\"\",IF(EXACT(BF25,BA25),\"YES\",\"NO\"),\"\")","v":""},{"$f":"IF(BF25<>\"\", IF(AND(BA25=\"I\",OR(BF25=\"S\",BF25=\"R\")),\"minE\",IF(AND(BF25=\"I\",OR(BA25=\"S\",BA25=\"R\")),\"minE\",IF(AND(BA25=\"R\",BF25=\"S\"),\"VME\",IF(AND(BA25=\"S\",BF25=\"R\"),\"ME\",\"\")))),\"\")","v":""},"<=",2,2,"S",1,null,null,"","","","","","","","","<=",0.5,0.5,"S",-1,null,null,"","","","","","","","","<=",1,1,"S",0,null,null,"","","","","","","","","<=",1,1,"S",0,null,null,"","","","","","","","","<=",1,1,"S",0,null,null,"","","","","","","","",">",8,16,"R",4,null,null,"","","","","","","","",">",8,16,"R",4,null,null,"","","","","","","",""]
[null,null,"AR0020","Escherichia coli","<=",0.125,0.125,"S",-3,null,null,"","","","","","","","","<=",0.125,0.125,"S",-3,null,null,"","","","","","","","",null,1,1,"S",0,null,null,"","","","","","","","",">",8,16,"R",4,null,null,"","","","","","",{"$f":"IF(BF26<>\"\",IF(EXACT(BF26,BA26),\"YES\",\"NO\"),\"\")","v":""},{"$f":"IF(BF26<>\"\", IF(AND(BA26=\"I\",OR(BF26=\"S\",BF26=\"R\")),\"minE\",IF(AND(BF26=\"I\",OR(BA26=\"S\",BA26=\"R\")),\"minE\",IF(AND(BA26=\"R\",BF26=\"S\"),\"VME\",IF(AND(BA26=\"S\",BF26=\"R\"),\"ME\",\"\")))),\"\")","v":""},"<=",2,2,"S",1,null,null,"","","","","","","","","<=",0.5,0.5,"S",-1,null,null,"","","","","","","","",null,2,2,"S",1,null,null,"","","","","","","","","<=",1,1,"S",0,null,null,"","","","","","","","","<=",1,1,"S",0,null,null,"","","","","","","","",">",8,16,"R",4,null,null,"","","","","","","","",">",8,16,"R",4,null,null,"","","","","","","",""]
[null,null,"AR0021","Citrobacter freundii","<=",0.125,0.125,"S",-3,null,null,"","","","","","","","","<=",0.125,0.125,"S",-3,null,null,"","","","","","","","","<=",0.5,0.5,"S",-1,null,null,"","","","","","","","",null,null,null,null,null,null,null,null,null,null,null,null,null,null,null,"<=",2,2,"S",1,null,null,"","","","","","","","","<=",0.5,0.5,"S",-1,null,null,"","","","","","","","","<=",1,1,"S",0,null,null,"","","","","","","","","<=",1,1,"S",0,null,null,"","","","","","","","","<=",1,1,"S",0,null,null,"","","","","","","","","<=",0.25,0.25,"S",-2,null,null,"","","","","","","","",null,0.5,0.5,"S",-1,null,null,"","","","","","","",""]
[null,null,"AR0022","Citrobacter freundii","<=",0.125,0.125,"S",-3,null,null,"","","","","","","","","<=",0.125,0.125,"S",-3,null,null,"","","","","","","","",null,1,1,"S",0,null,null,"","","","","","","","",null,null,null,null,null,null,null,null,null,null,null,null,null,null,null,"<=",2,2,"S",1,null,null,"","","","","","","","","<=",0.5,0.5,"S",-1,null,null,"","","","","","","","","<=",1,1,"S",0,null,null,"","","","","","","","","<=",0.5,0.5,"S",-1,null,null,"","","","","","","","","<=",1,1,"S",0,null,null,"","","","","","","","","<=",0.25,0.25,"S",-2,null,null,"","","","","","","","","<=",0.125,0.125,"S",-3,null,null,"","","","","","","",""]
[null,null,"AR0023","Citrobacter freundii","<=",0.125,0.125,"S",-3,null,null,"","","","","","","","","<=",0.125,0.125,"S",-3,null,null,"","","","","","","","","<=",0.5,0.5,"S",-1,null,null,"","","","","","","","",null,null,null,null,null,null,null,null,null,null,null,null,null,null,null,"<=",2,2,"S",1,null,null,"","","","","","","","","<=",0.5,0.5,"S",-1,null,null,"","","","","","","","","<=",1,1,"S",0,null,null,"","","","","","","","","<=",1,1,"S",0,null,null,"","","","","","","","","<=",1,1,"S",0,null,null,"","","","","","","","","<=",0.25,0.25,"S",-2,null,null,"","","","","","","","",null,1,1,"I",0,null,null,"","","","","","","",""]
[null,null,"AR0024","Citrobacter koseri","<=",0.125,0.125,"S",-3,null,null,"","","","","","","","","<=",0.125,0.125,"S",-3,null,null,"","","","","","","","","<=",0.5,0.5,"S",-1,null,null,"","","","","","","","",null,2,2,{"$f":"IF((ISNUMBER(AZ30)),\nIF(AZ30<=2,\"S\",\nIF(AZ30=4,\"I\",\nIF(AZ30>=8,\"R\", \"\"))),\"\")","v":"S"},1,null,null,"",{"$f":"IF((ISNUMBER(BE30)),\nIF(BE30<=2,\"S\",\nIF(BE30=4,\"I\",\nIF(BE30>=8,\"R\", \"\"))),\"\")","v":""},"","","","",{"$f":"IF(BF30<>\"\",IF(EXACT(BF30,BA30),\"YES\",\"NO\"),\"\")","v":""},{"$f":"IF(BF30<>\"\", IF(AND(BA30=\"I\",OR(BF30=\"S\",BF30=\"R\")),\"minE\",IF(AND(BF30=\"I\",OR(BA30=\"S\",BA30=\"R\")),\"minE\",IF(AND(BA30=\"R\",BF30=\"S\"),\"VME\",IF(AND(BA30=\"S\",BF30=\"R\"),\"ME\",\"\")))),\"\")","v":""},"<=",2,2,"S",1,null,null,"","","","","","","","","<=",0.5,0.5,"S",-1,null,null,"","","","","","","","","<=",1,1,"S",0,null,null,"","","","","","","","","<=",1,1,"S",0,null,null,"","","","","","","","","<=",1,1,"S",0,null,null,"","","","","","","","","<=",0.25,0.25,"S",-2,null,null,"","","","","","","","","<=",0.25,0.25,"S",-2,null,null,"","","","","","","",""]
[null,null,"AR0025","Citrobacter koseri","<=",0.125,0.125,"S",-3,null,null,"","","","","","","","","<=",0.125,0.125,"S",-3,null,null,"","","","","","","","","<=",0.5,0.5,"S",-1,null,null,"","","","","","","","",null,8,8,"R",3,null,null,"","","","","","",{"$f":"IF(BF31<>\"\",IF(EXACT(BF31,BA31),\"YES\",\"NO\"),\"\")","v":""},{"$f":"IF(BF31<>\"\", IF(AND(BA31=\"I\",OR(BF31=\"S\",BF31=\"R\")),\"minE\",IF(AND(BF31=\"I\",OR(BA31=\"S\",BA31=\"R\")),\"minE\",IF(AND(BA31=\"R\",BF31=\"S\"),\"VME\",IF(AND(BA31=\"S\",BF31=\"R\"),\"ME\",\"\")))),\"\")","v":""},"<=",2,2,"S",1,null,null,"","","","","","","","","<=",0.5,0.5,"S",-1,null,null,"","","","","","","","","<=",1,1,"S",0,null,null,"","","","","","","","","<=",0.5,0.5,"S",-1,null,null,"","","","","","","","","<=",1,1,"S",0,null,null,"","","","","","","","","<=",0.25,0.25,"S",-2,null,null,"","","","","","","","","<=",0.25,0.25,"S",-2,null,null,"","","","","","","",""]
[null,null,"AR0026","Providencia stuartii","<=",0.125,0.125,"S",-3,null,null,"","","","","","","","","<=",0.125,0.125,"S",-3,null,null,"","","","","","","","","<=",0.5,0.5,"S",-1,null,null,"","","","","","","","",null,null,null,null,null,null,null,null,null,null,null,null,null,null,null,"<=",2,2,"S",1,null,null,"","","","","","","","","<=",0.5,0.5,"S",-1,null,null,"","","","","","","","","<=",1,1,"S",0,null,null,"","","","","","","","","<=",1,1,"S",0,null,null,"","","","","","","","","<=",1,1,"S",0,null,null,"","","","","","","","","<=",0.25,0.25,"S",-2,null,null,"","","","","","","","",null,1,1,"I",0,null,null,"","","","","","","",""]
[null,null,"AR0027","Serratia marcescens","<=",0.125,0.125,"S",-3,null,null,"","","","","","","","","<=",0.125,0.125,"S",-3,null,null,"","","","","","","","","<=",0.5,0.5,"S",-1,null,null,"","","","","","","","",null,null,null,null,null,null,null,null,null,null,null,null,null,null,null,"<=",2,2,"S",1,null,null,"","","","","","","","","<=",0.5,0.5,"S",-1,null,null,"","","","","","","","","<=",1,1,"S",0,null,null,"","","","","","","","","<=",1,1,"S",0,null,null,"","","","","","","","","<=",1,1,"S",0,null,null,"","","","","","","","",null,1,1,"R",0,null,null,"","","","","","","","",null,1,1,"I",0,null,null,"","","","","","","",""]
[null,null,"AR0028","Klebsiella oxytoca","<=",0.125,0.125,"S",-3,null,null,"","","","","","","","","<=",0.125,0.125,"S",-3,null,null,"","","","","","","","","<=",0.5,0.5,"S",-1,null,null,"","","","","","","","",">",8,16,{"$f":"IF((ISNUMBER(AZ34)),\nIF(AZ34<=2,\"S\",\nIF(AZ34=4,\"I\",\nIF(AZ34>=8,\"R\", \"\"))),\"\")","v":"R"},4,null,null,"",{"$f":"IF((ISNUMBER(BE34)),\nIF(BE34<=2,\"S\",\nIF(BE34=4,\"I\",\nIF(BE34>=8,\"R\", \"\"))),\"\")","v":""},"","","","",{"$f":"IF(BF34<>\"\",IF(EXACT(BF34,BA34),\"YES\",\"NO\"),\"\")","v":""},{"$f":"IF(BF34<>\"\", IF(AND(BA34=\"I\",OR(BF34=\"S\",BF34=\"R\")),\"minE\",IF(AND(BF34=\"I\",OR(BA34=\"S\",BA34=\"R\")),\"minE\",IF(AND(BA34=\"R\",BF34=\"S\"),\"VME\",IF(AND(BA34=\"S\",BF34=\"R\"),\"ME\",\"\")))),\"\")","v":""},"<=",2,2,"S",1,null,null,"","","","","","","","","<=",0.5,0.5,"S",-1,null,null,"","","","","","","","","<=",1,1,"S",0,null,null,"","","","","","","","","<=",1,1,"S",0,null,null,"","","","","","","","","<=",1,1,"S",0,null,null,"","","","","","","","","<=",0.25,0.25,"S",-2,null,null,"","","","","","","","","<=",0.25,0.25,"S",-2,null,null,"","","","","","","",""]
[null,null,"AR0029","Proteus mirabilis",null,0.25,0.25,"S",-2,null,null,"","","","","","","","",null,0.5,0.5,"S",-1,null,null,"","","","","","","","",null,4,4,"R",2,null,null,"","","","","","","","",null,8,8,"R",3,null,null,"","","","","","",{"$f":"IF(BF35<>\"\",IF(EXACT(BF35,BA35),\"YES\",\"NO\"),\"\")","v":""},{"$f":"IF(BF35<>\"\", IF(AND(BA35=\"I\",OR(BF35=\"S\",BF35=\"R\")),\"minE\",IF(AND(BF35=\"I\",OR(BA35=\"S\",BA35=\"R\")),\"minE\",IF(AND(BA35=\"R\",BF35=\"S\"),\"VME\",IF(AND(BA35=\"S\",BF35=\"R\"),\"ME\",\"\")))),\"\")","v":""},"<=",2,2,"S",1,null,null,"","","","","","","","","<=",0.5,0.5,"S",-1,null,null,"","","","","","","","","<=",1,1,"S",0,null,null,"","","","","","","","","<=",1,1,"S",0,null,null,"","","","","","","","","<=",1,1,"S",0,null,null,"","","","","","","","","<=",0.25,0.25,"S",-2,null,null,"","","","","","","","","<=",0.25,0.25,"S",-2,null,null,"","","","","","","",""]
[null,null,"AR0030","Shigella sonnei","<=",0.125,0.125,"S",-3,null,null,"","","","","","","","","<=",0.125,0.125,"S",-3,null,null,"","","","","","","","","<=",0.5,0.5,"S",-1,null,null,"","","","","","","","",null,null,null,null,null,null,null,null,null,null,null,null,null,null,null,"<=",2,2,"S",1,null,null,"","","","","","","","","<=",0.5,0.5,"S",-1,null,null,"","","","","","","","","<=",1,1,"S",0,null,null,"","","","","","","","","<=",1,1,"S",0,null,null,"","","","","","","","","<=",1,1,"S",0,null,null,"","","","","","","","","<=",0.25,0.25,"S",-2,null,null,"","","","","","","","","<=",0.25,0.25,"S",-2,null,null,"","","","","","","",""]
[null,null,"AR0031","Salmonella Typhimurium","<=",0.125,0.125,"S",-3,null,null,"","","","","","","","","<=",0.125,0.125,"S",-3,null,null,"","","","","","","","","<=",0.5,0.5,"S",-1,null,null,"","","","","","","","",null,null,null,null,null,null,null,null,null,null,null,null,null,null,null,"<=",2,2,"S",1,null,null,"","","","","","","","","<=",0.5,0.5,"S",-1,null,null,"","","","","","","","","<=",1,1,"S",0,null,null,"","","","","","","","","<=",1,1,"S",0,null,null,"","","","","","","","","<=",1,1,"S",0,null,null,"","","","","","","","",null,null,"",{"$f":"IF((ISNUMBER(EL37)),\nIF(AND(#REF!=\"ENT\",EL37<=0.25),\"S\",\nIF(AND(#REF!=\"ENT\",EL37=0.5),\"I\",\nIF(AND(#REF!=\"ENT\",EL37>=1),\"R\", \"\"))),\"\")","v":""},"",null,null,"",{"$f":"IF((ISNUMBER(EQ37)),\nIF(AND(#REF!=\"ENT\",EQ37<=0.25),\"S\",\nIF(AND(#REF!=\"ENT\",EQ37=0.5),\"I\",\nIF(AND(#REF!=\"ENT\",EQ37>=1),\"R\", \"\"))),\"\")","v":""},"","","","","","",null,null,null,null,"",null,null,"",{"$f":"IF((ISNUMBER(FF37)),\nIF(AND(#REF!=\"ENT\",FF37<=0.5),\"S\",\nIF(AND(#REF!=\"ENT\",FF37=1),\"I\",\nIF(AND(#REF!=\"ENT\",FF37>=2),\"R\", \"\"))),\"\")","v":""},"","","","","",""]
[null,null,null,null,null,null,null,null,null,null,null,null,null,null,null,null,null,null,null,null,null,null,null,null,null,null,null,null,null,null,null,null,null,null,null,null,null,null,null,null,null,null,null,null,null,null,null,null,null,"Note: Organisms with intrinsic resistance should not be included. See M100 Appendix B."]
["*Breakpoints used for therapy of infections other than uncomplicated UTIs due to E. coli, K. pneumoniae, and P. mirabilis. Breakpoints are based on a dosage regimen of 2 g administered every 8 h.",null,null,null,null,null,null,null,null,null,null,null,null,null,null,null,null,null,null,null,null,null,null,null,null,null,null,null,null,null,null,null,null,null,null,null,null,null,null,null,null,null,null,null,null,null,null,null,null,null,null,null,null,""]
[null,null,null,null,null,null,null,null,null,"Summary Data",null,null,null,null,null,null,null,null,null,null,null,null,null,null,"Summary Data",null,null,null,null,null,null,null,null,null,null,null,null,null,null,"Summary Data",null,null,null,null,null,null,null,null,null,null,null,null,null,null,"Summary Data",null,null,null,null,null,null,null,null,null,null,null,null,null,null,"Summary Data",null,null,null,null,null,null,null,null,null,null,null,null,null,null,"Summary Data",null,null,null,null,null,null,null,null,null,null,null,null,null,null,"Summary Data",null,null,null,null,null,null,null,null,null,null,null,null,null,null,"Summary Data",null,null,null,null,null,null,null,null,null,null,null,null,null,null,"Summary Data",null,null,null,null,null,null,null,null,null,null,null,null,null,null,"Summary Data",null,null,null,null,null,null,null,null,null,null,null,null,null,null,"Summary Data"]
[null,null,null,null,null,null,null,null,null,"%","N",null,"Total N",null,null,null,null,null,null,null,null,null,null,null,"%","N",null,"Total N",null,null,null,null,null,null,null,null,null,null,null,"%","N",null,"Total N",null,null,null,null,null,null,null,null,null,null,null,"%","N",null,"Total N",null,null,null,null,null,null,null,null,null,null,null,"%","N",null,"Total N",null,null,null,null,null,null,null,null,null,null,null,"%","N",null,"Total N",null,null,null,null,null,null,null,null,null,null,null,"%","N",null,"Total N",null,null,null,null,null,null,null,null,null,null,null,"%","N",null,"Total N",null,null,null,null,null,null,null,null,null,null,null,"%","N",null,"Total N",null,null,null,null,null,null,null,null,null,null,null,"%","N",null,"Total N",null,null,null,null,null,null,null,null,null,null,null,"%","N",null,"Total N"]
[null,null,null,null,null,null,null,"EA",null,{"$f":"IF(M42=0,\"\",K42/M42)","v":""},{"$f":"COUNTIF(O7:O37, \"YES\")","v":0},null,{"$f":"COUNTIFS( K7:K37,\">0\")","v":0},null,null,null,null,null,null,null,null,null,"EA",null,{"$f":"IF(AB42=0,\"\",Z42/AB42)","v":""},{"$f":"COUNTIF(AD7:AD37, \"YES\")","v":0},null,{"$f":"COUNTIFS( Z7:Z37,\">0\")","v":0},null,null,null,null,null,null,null,null,null,"EA",null,{"$f":"IF(AQ42=0,\"\",AO42/AQ42)","v":""},{"$f":"COUNTIF(AS7:AS37, \"YES\")","v":0},null,{"$f":"COUNTIFS( AO7:AO37,\">0\")","v":0},null,null,null,null,null,null,null,null,null,"EA",null,{"$f":"IF(BF42=0,\"\",BD42/BF42)","v":""},{"$f":"COUNTIF(BH7:BH37, \"YES\")","v":0},null,{"$f":"COUNTIFS( BD7:BD37,\">0\")","v":0},null,null,null,null,null,null,null,null,null,"EA",null,{"$f":"IF(BU42=0,\"\",BS42/BU42)","v":""},{"$f":"COUNTIF(BW7:BW37, \"YES\")","v":0},null,{"$f":"COUNTIFS( BS7:BS37,\">0\")","v":0},null,null,null,null,null,null,null,null,null,"EA",null,{"$f":"IF(CJ42=0,\"\",CH42/CJ42)","v":""},{"$f":"COUNTIF(CL7:CL37, \"YES\")","v":0},null,{"$f":"COUNTIFS( CH7:CH37,\">0\")","v":0},null,null,null,null,null,null,null,null,null,"EA",null,{"$f":"IF(CY42=0,\"\",CW42/CY42)","v":""},{"$f":"COUNTIF(DA7:DA37, \"YES\")","v":0},null,{"$f":"COUNTIFS( CW7:CW37,\">0\")","v":0},null,null,null,null,null,null,null,null,null,"EA",null,{"$f":"IF(DN42=0,\"\",DL42/DN42)","v":""},{"$f":"COUNTIF(DP7:DP37, \"YES\")","v":0},null,{"$f":"COUNTIFS( DL7:DL37,\">0\")","v":0},null,null,null,null,null,null,null,null,null,"EA",null,{"$f":"IF(EC42=0,\"\",EA42/EC42)","v":""},{"$f":"COUNTIF(EE7:EE37, \"YES\")","v":0},null,{"$f":"COUNTIFS( EA7:EA37,\">0\")","v":0},null,null,null,null,null,null,null,null,null,"EA",null,{"$f":"IF(ER42=0,\"\",EP42/ER42)","v":""},{"$f":"COUNTIF(ET7:ET37, \"YES\")","v":0},null,{"$f":"COUNTIFS( EP7:EP37,\">0\")","v":0},null,null,null,null,null,null,null,null,null,"EA",null,{"$f":"IF(FG42=0,\"\",FE42/FG42)","v":""},{"$f":"COUNTIF(FI7:FI37, \"YES\")","v":0},null,{"$f":"COUNTIFS( FE7:FE37,\">0\")","v":0}]
[null,null,null,null,null,null,null,"CA",null,{"$f":"IF(M43=0,\"\",K43/M43)","v":""},{"$f":"COUNTIF(R7:R37, \"YES\")","v":0},null,{"$f":"COUNTIFS( M7:M37,\"R\")+COUNTIFS( M7:M37,\"I\")+COUNTIFS( M7:M37,\"S\")","v":0},null,null,null,null,null,null,null,null,null,"CA",null,{"$f":"IF(AB43=0,\"\",Z43/AB43)","v":""},{"$f":"COUNTIF(AG7:AG37, \"YES\")","v":0},null,{"$f":"COUNTIFS( AB7:AB37,\"R\")+COUNTIFS( AB7:AB37,\"I\")+COUNTIFS( AB7:AB37,\"S\")","v":0},null,null,null,null,null,null,null,null,null,"CA",null,{"$f":"IF(AQ43=0,\"\",AO43/AQ43)","v":""},{"$f":"COUNTIF(AV7:AV37, \"YES\")","v":0},null,{"$f":"COUNTIFS( AQ7:AQ37,\"R\")+COUNTIFS( AQ7:AQ37,\"I\")+COUNTIFS( AQ7:AQ37,\"S\")","v":0},null,null,null,null,null,null,null,null,null,"CA",null,{"$f":"IF(BF43=0,\"\",BD43/BF43)","v":""},{"$f":"COUNTIF(BK7:BK37, \"YES\")","v":0},null,{"$f":"COUNTIFS( BF7:BF37,\"R\")+COUNTIFS( BF7:BF37,\"I\")+COUNTIFS( BF7:BF37,\"S\")","v":0},null,null,null,null,null,null,null,null,null,"CA",null,{"$f":"IF(BU43=0,\"\",BS43/BU43)","v":""},{"$f":"COUNTIF(BZ7:BZ37, \"YES\")","v":0},null,{"$f":"COUNTIFS( BU7:BU37,\"R\")+COUNTIFS( BU7:BU37,\"I\")+COUNTIFS( BU7:BU37,\"S\")","v":0},null,null,null,null,null,null,null,null,null,"CA",null,{"$f":"IF(CJ43=0,\"\",CH43/CJ43)","v":""},{"$f":"COUNTIF(CO7:CO37, \"YES\")","v":0},null,{"$f":"COUNTIFS( CJ7:CJ37,\"R\")+COUNTIFS( CJ7:CJ37,\"SDD\")+COUNTIFS( CJ7:CJ37,\"S\")","v":0},null,null,null,null,null,null,null,null,null,"CA",null,{"$f":"IF(CY43=0,\"\",CW43/CY43)","v":""},{"$f":"COUNTIF(DD7:DD37, \"YES\")","v":0},null,{"$f":"COUNTIFS( CY7:CY37,\"R\")+COUNTIFS( CY7:CY37,\"I\")+COUNTIFS( CY7:CY37,\"S\")","v":0},null,null,null,null,null,null,null,null,null,"CA",null,{"$f":"IF(DN43=0,\"\",DL43/DN43)","v":""},{"$f":"COUNTIF(DS7:DS37, \"YES\")","v":0},null,{"$f":"COUNTIFS( DN7:DN37,\"R\")+COUNTIFS( DN7:DN37,\"I\")+COUNTIFS( DN7:DN37,\"S\")","v":0},null,null,null,null,null,null,null,null,null,"CA",null,{"$f":"IF(EC43=0,\"\",EA43/EC43)","v":""},{"$f":"COUNTIF(EH7:EH37, \"YES\")","v":0},null,{"$f":"COUNTIFS( EC7:EC37,\"R\")+COUNTIFS( EC7:EC37,\"I\")+COUNTIFS( EC7:EC37,\"S\")","v":0},null,null,null,null,null,null,null,null,null,"CA",null,{"$f":"IF(ER43=0,\"\",EP43/ER43)","v":""},{"$f":"COUNTIF(EW7:EW37, \"YES\")","v":0},null,{"$f":"COUNTIFS( ER7:ER37,\"R\")+COUNTIFS( ER7:ER37,\"I\")+COUNTIFS( ER7:ER37,\"S\")","v":0},null,null,null,null,null,null,null,null,null,"CA",null,{"$f":"IF(FG43=0,\"\",FE43/FG43)","v":""},{"$f":"COUNTIF(FL7:FL37, \"YES\")","v":0},null,{"$f":"COUNTIFS( FG7:FG37,\"R\")+COUNTIFS( FG7:FG37,\"I\")+COUNTIFS( FG7:FG37,\"S\")","v":0}]
[null,null,null,null,null,null,null,"minE",null,"",{"$f":"COUNTIF(S7:S37, \"minE\")","v":0},null,{"$f":"M43","v":0},null,null,null,null,null,null,null,null,null,"minE",null,"",{"$f":"COUNTIF(AH7:AH37, \"minE\")","v":0},null,{"$f":"AB43","v":0},null,null,null,null,null,null,null,null,null,"minE",null,"",{"$f":"COUNTIF(AW7:AW37, \"minE\")","v":0},null,{"$f":"AQ43","v":0},null,null,null,null,null,null,null,null,null,"minE",null,"",{"$f":"COUNTIF(BL7:BL37, \"minE\")","v":0},null,{"$f":"BF43","v":0},null,null,null,null,null,null,null,null,null,"minE",null,"",{"$f":"COUNTIF(CA7:CA37, \"minE\")","v":0},null,{"$f":"BU43","v":0},null,null,null,null,null,null,null,null,null,"minE",null,"",{"$f":"COUNTIF(CP7:CP37, \"minE\")","v":0},null,{"$f":"CJ43","v":0},null,null,null,null,null,null,null,null,null,"minE",null,"",{"$f":"COUNTIF(DE7:DE37, \"minE\")","v":0},null,{"$f":"CY43","v":0},null,null,null,null,null,null,null,null,null,"minE",null,"",{"$f":"COUNTIF(DT7:DT37, \"minE\")","v":0},null,{"$f":"DN43","v":0},null,null,null,null,null,null,null,null,null,"minE",null,"",{"$f":"COUNTIF(EI7:EI37, \"minE\")","v":0},null,{"$f":"EC43","v":0},null,null,null,null,null,null,null,null,null,"minE",null,"",{"$f":"COUNTIF(EX7:EX37, \"minE\")","v":0},null,{"$f":"ER43","v":0},null,null,null,null,null,null,null,null,null,"minE",null,"",{"$f":"COUNTIF(FM7:FM37, \"minE\")","v":0},null,{"$f":"FG43","v":0}]
[null,null,null,null,null,null,null,"ME",null,{"$f":"IF(M43=0, \"\",K45/M45)","v":""},{"$f":"COUNTIFS( S7:S37, \"ME\")","v":0},null,{"$f":"COUNTIFS( H7:H37,\"S\", K7:K37, \">0\")","v":0},null,null,null,null,null,null,null,null,null,"ME",null,{"$f":"IF(AB43=0, \"\",Z45/AB45)","v":""},{"$f":"COUNTIFS( AH7:AH37, \"ME\")","v":0},null,{"$f":"COUNTIFS( W7:W37,\"S\", Z7:Z37, \">0\")","v":0},null,null,null,null,null,null,null,null,null,"ME",null,{"$f":"IF(AQ43=0, \"\",AO45/AQ45)","v":""},{"$f":"COUNTIFS( AW7:AW37, \"ME\")","v":0},null,{"$f":"COUNTIFS( AL7:AL37,\"S\", AO7:AO37, \">0\")","v":0},null,null,null,null,null,null,null,null,null,"ME",null,{"$f":"IF(BF43=0, \"\",BD45/BF45)","v":""},{"$f":"COUNTIFS( BL7:BL37, \"ME\")","v":0},null,{"$f":"COUNTIFS( BA7:BA37,\"S\", BD7:BD37, \">0\")","v":0},null,null,null,null,null,null,null,null,null,"ME",null,{"$f":"IF(BU43=0, \"\",BS45/BU45)","v":""},{"$f":"COUNTIFS( CA7:CA37, \"ME\")","v":0},null,{"$f":"COUNTIFS( BP7:BP37,\"S\", BS7:BS37, \">0\")","v":0},null,null,null,null,null,null,null,null,null,"ME",null,{"$f":"IF(CJ43=0, \"\",CH45/CJ45)","v":""},{"$f":"COUNTIFS( CP7:CP37, \"ME\")","v":0},null,{"$f":"COUNTIFS( CE7:CE37,\"S\", CH7:CH37, \">0\")","v":0},null,null,null,null,null,null,null,null,null,"ME",null,{"$f":"IF(CY43=0, \"\",CW45/CY45)","v":""},{"$f":"COUNTIFS( DE7:DE37, \"ME\")","v":0},null,{"$f":"COUNTIFS( CT7:CT37,\"S\", CW7:CW37, \">0\")","v":0},null,null,null,null,null,null,null,null,null,"ME",null,{"$f":"IF(DN43=0, \"\",DL45/DN45)","v":""},{"$f":"COUNTIFS( DT7:DT37, \"ME\")","v":0},null,{"$f":"COUNTIFS( DI7:DI37,\"S\", DL7:DL37, \">0\")","v":0},null,null,null,null,null,null,null,null,null,"ME",null,{"$f":"IF(EC43=0, \"\",EA45/EC45)","v":""},{"$f":"COUNTIFS( EI7:EI37, \"ME\")","v":0},null,{"$f":"COUNTIFS( DX7:DX37,\"S\", EA7:EA37, \">0\")","v":0},null,null,null,null,null,null,null,null,null,"ME",null,{"$f":"IF(ER43=0, \"\",EP45/ER45)","v":""},{"$f":"COUNTIFS( EX7:EX37, \"ME\")","v":0},null,{"$f":"COUNTIFS( EM7:EM37,\"S\", EP7:EP37, \">0\")","v":0},null,null,null,null,null,null,null,null,null,"ME",null,{"$f":"IF(FG43=0, \"\",FE45/FG45)","v":""},{"$f":"COUNTIFS( FM7:FM37, \"ME\")","v":0},null,{"$f":"COUNTIFS( FB7:FB37,\"S\", FE7:FE37, \">0\")","v":0}]
[null,null,null,null,null,null,null,"VME",null,{"$f":"IF(M43=0,\"\",K46/M46)","v":""},{"$f":"COUNTIFS(S7:S37, \"VME\")","v":0},null,{"$f":"COUNTIFS( H7:H37,\"R\",K7:K37, \">0\")","v":0},null,null,null,null,null,null,null,null,null,"VME",null,{"$f":"IF(AB43=0,\"\",Z46/AB46)","v":""},{"$f":"COUNTIFS(AH7:AH37, \"VME\")","v":0},null,{"$f":"COUNTIFS( W7:W37,\"R\",Z7:Z37, \">0\")","v":0},null,null,null,null,null,null,null,null,null,"VME",null,{"$f":"IF(AQ43=0,\"\",AO46/AQ46)","v":""},{"$f":"COUNTIFS(AW7:AW37, \"VME\")","v":0},null,{"$f":"COUNTIFS( AL7:AL37,\"R\",AO7:AO37, \">0\")","v":0},null,null,null,null,null,null,null,null,null,"VME",null,{"$f":"IF(BF43=0,\"\",BD46/BF46)","v":""},{"$f":"COUNTIFS(BL7:BL37, \"VME\")","v":0},null,{"$f":"COUNTIFS( BA7:BA37,\"R\",BD7:BD37, \">0\")","v":0},null,null,null,null,null,null,null,null,null,"VME",null,{"$f":"IF(BU43=0,\"\",BS46/BU46)","v":""},{"$f":"COUNTIFS(CA7:CA37, \"VME\")","v":0},null,{"$f":"COUNTIFS( BP7:BP37,\"R\",BS7:BS37, \">0\")","v":0},null,null,null,null,null,null,null,null,null,"VME",null,{"$f":"IF(CJ43=0,\"\",CH46/CJ46)","v":""},{"$f":"COUNTIFS(CP7:CP37, \"VME\")","v":0},null,{"$f":"COUNTIFS( CE7:CE37,\"R\",CH7:CH37, \">0\")","v":0},null,null,null,null,null,null,null,null,null,"VME",null,{"$f":"IF(CY43=0,\"\",CW46/CY46)","v":""},{"$f":"COUNTIFS(DE7:DE37, \"VME\")","v":0},null,{"$f":"COUNTIFS( CT7:CT37,\"R\",CW7:CW37, \">0\")","v":0},null,null,null,null,null,null,null,null,null,"VME",null,{"$f":"IF(DN43=0,\"\",DL46/DN46)","v":""},{"$f":"COUNTIFS(DT7:DT37, \"VME\")","v":0},null,{"$f":"COUNTIFS( DI7:DI37,\"R\",DL7:DL37, \">0\")","v":0},null,null,null,null,null,null,null,null,null,"VME",null,{"$f":"IF(EC43=0,\"\",EA46/EC46)","v":""},{"$f":"COUNTIFS(EI7:EI37, \"VME\")","v":0},null,{"$f":"COUNTIFS( DX7:DX37,\"R\",EA7:EA37, \">0\")","v":0},null,null,null,null,null,null,null,null,null,"VME",null,{"$f":"IF(ER43=0,\"\",EP46/ER46)","v":""},{"$f":"COUNTIFS(EX7:EX37, \"VME\")","v":0},null,{"$f":"COUNTIFS( EM7:EM37,\"R\",EP7:EP37, \">0\")","v":0},null,null,null,null,null,null,null,null,null,"VME",null,{"$f":"IF(FG43=0,\"\",FE46/FG46)","v":""},{"$f":"COUNTIFS(FM7:FM37, \"VME\")","v":0},null,{"$f":"COUNTIFS( FB7:FB37,\"R\",FE7:FE37, \">0\")","v":0}]

{"sheet":"BIT-1 Precision","index":4,"n_rows":111,"n_cols":25,"rows_kept":111,"cut":false,"hidden":false,"merged":[[54,1,55,1],[64,0,65,0],[64,1,65,1],[54,8,55,8],[57,17,60,20],[64,8,65,8],[54,2,54,3],[54,4,54,5],[54,6,54,7],[64,2,64,3],[64,4,64,5],[64,6,64,7],[74,0,75,0],[74,1,75,1],[14,2,14,3],[14,4,14,5],[14,6,14,7],[23,0,23,20],[53,0,53,20],[63,0,63,20],[73,0,73,20],[34,2,34,3],[34,4,34,5],[34,6,34,7],[44,2,44,3],[44,4,44,5],[44,6,44,7],[54,0,55,0],[1,0,1,20],[4,6,4,7],[4,4,4,5],[4,2,4,3],[3,0,3,20],[4,0,5,0],[4,1,5,1],[4,8,5,8],[7,17,10,20],[17,17,20,20],[27,17,30,20],[37,17,40,20],[47,17,50,20],[33,0,33,20],[43,0,43,20],[24,0,25,0],[24,1,25,1],[34,0,35,0],[34,1,35,1],[24,8,25,8],[34,8,35,8],[44,0,45,0],[44,1,45,1],[13,0,13,20],[94,0,95,0],[94,1,95,1],[67,17,70,20],[77,17,80,20],[87,17,90,20],[74,2,74,3],[74,4,74,5],[74,6,74,7],[84,2,84,3],[84,4,84,5],[84,6,84,7],[83,0,83,20],[84,0,85,0],[84,1,85,1],[74,8,75,8],[84,8,85,8],[104,2,104,3],[104,4,104,5],[104,6,104,7],[103,0,103,20],[97,17,100,20],[107,17,110,20],[93,0,93,20],[14,0,15,0],[14,1,15,1],[44,8,45,8],[14,8,15,8],[24,2,24,3],[24,4,24,5],[24,6,24,7],[104,0,105,0],[104,1,105,1],[94,8,95,8],[104,8,105,8],[94,2,94,3],[94,4,94,5],[94,6,94,7]]}
[null,null,null,null,null,null,null,null,null,null,null,null,null,null,null,null,null,null,null,null,null,null,null,"Interp","Number"]
["Precision (Reproducibility) for BIT-1 (AR Bank Panel: BIT)",null,null,null,null,null,null,null,null,null,null,null,null,null,null,null,null,null,null,null,null,null,1,"S",1]
[null,null,null,null,null,null,null,null,null,null,null,null,null,null,null,null,null,null,null,null,null,null,2,"I",2]
["Aztreonam",null,null,null,null,null,null,null,null,null,null,null,null,null,null,null,null,null,null,null,null,null,3,"R",3]
["Isolate","Organism","Result 1",null,"Result 2",null,"Result 3",null,"Interpretation Mode or Median","Result 1","Result 2","Result 3","Mode","Result 1","Result 2","Result 3",null,null,"N","%","N Results Total",null,4,"SDD",4]
[null,null,"Intials, Date Tested","Interp","Intials, Date Tested","Interp","Intials, Date Tested","Interp",null,"Equivalency","Equivalency","Equivalency","Interp","Interp","Interp","Interp",null,"Category Equivalency",{"$f":"COUNTIF(J7:L11,\"Yes\")","v":0},{"$f":"IF(U6>0, S6/U6,\"\")","v":""},{"$f":"COUNTIF(J7:L11,\"Yes\")+COUNTIF(J7:L11,\"No\")","v":0}]
[null,null,null,null,null,null,null,null,{"$f":"IF(M7<>\"\",VLOOKUP(M7,NUM_SIR,2, FALSE),\"\")","v":""},{"$f":"IF(AND($M7<>\"\",N7<>\"\"),IF(N7=$M7, \"Yes\",\"No\"),\"\")","v":""},{"$f":"IF(AND($M7<>\"\",O7<>\"\"),IF(O7=$M7, \"Yes\",\"No\"),\"\")","v":""},{"$f":"IF(AND($M7<>\"\",P7<>\"\"),IF(P7=$M7, \"Yes\",\"No\"),\"\")","v":""},{"$f":"IF(SUM(N7:P7)>0,IF(ISERROR(MODE(N7:P7)),MEDIAN(N7:P7),MODE(N7:P7)),\"\")","v":""},{"$f":"IF(D7<>\"\",VLOOKUP(D7,SIR_NUM,2,FALSE),\"\")","v":""},{"$f":"IF(F7<>\"\",VLOOKUP(F7,SIR_NUM,2,FALSE),\"\")","v":""},{"$f":"IF(H7<>\"\",VLOOKUP(H7,SIR_NUM,2,FALSE),\"\")","v":""},null,null,null,null,null,null,null,"Interp","Number"]
[null,null,null,null,null,null,null,null,{"$f":"IF(M8<>\"\",VLOOKUP(M8,NUM_SIR,2, FALSE),\"\")","v":""},"","","",{"$f":"IF(SUM(N8:P8)>0,IF(ISERROR(MODE(N8:P8)),MEDIAN(N8:P8),MODE(N8:P8)),\"\")","v":""},{"$f":"IF(D8<>\"\",VLOOKUP(D8,SIR_NUM,2,FALSE),\"\")","v":""},{"$f":"IF(F8<>\"\",VLOOKUP(F8,SIR_NUM,2,FALSE),\"\")","v":""},{"$f":"IF(H8<>\"\",VLOOKUP(H8,SIR_NUM,2,FALSE),\"\")","v":""},null,0,null,null,null,null,1,"S",1]
[null,null,null,null,null,null,null,null,{"$f":"IF(M9<>\"\",VLOOKUP(M9,NUM_SIR,2, FALSE),\"\")","v":""},"","","",{"$f":"IF(SUM(N9:P9)>0,IF(ISERROR(MODE(N9:P9)),MEDIAN(N9:P9),MODE(N9:P9)),\"\")","v":""},{"$f":"IF(D9<>\"\",VLOOKUP(D9,SIR_NUM,2,FALSE),\"\")","v":""},{"$f":"IF(F9<>\"\",VLOOKUP(F9,SIR_NUM,2,FALSE),\"\")","v":""},{"$f":"IF(H9<>\"\",VLOOKUP(H9,SIR_NUM,2,FALSE),\"\")","v":""},null,null,null,null,null,null,2,"SDD",2]
[null,null,null,null,null,null,null,null,{"$f":"IF(M10<>\"\",VLOOKUP(M10,NUM_SIR,2, FALSE),\"\")","v":""},"","","",{"$f":"IF(SUM(N10:P10)>0,IF(ISERROR(MODE(N10:P10)),MEDIAN(N10:P10),MODE(N10:P10)),\"\")","v":""},{"$f":"IF(D10<>\"\",VLOOKUP(D10,SIR_NUM,2,FALSE),\"\")","v":""},{"$f":"IF(F10<>\"\",VLOOKUP(F10,SIR_NUM,2,FALSE),\"\")","v":""},{"$f":"IF(H10<>\"\",VLOOKUP(H10,SIR_NUM,2,FALSE),\"\")","v":""},null,null,null,null,null,null,3,"R",3]
[null,null,null,null,null,null,null,null,{"$f":"IF(M11<>\"\",VLOOKUP(M11,NUM_SIR,2, FALSE),\"\")","v":""},"","","",{"$f":"IF(SUM(N11:P11)>0,IF(ISERROR(MODE(N11:P11)),MEDIAN(N11:P11),MODE(N11:P11)),\"\")","v":""},{"$f":"IF(D11<>\"\",VLOOKUP(D11,SIR_NUM,2,FALSE),\"\")","v":""},{"$f":"IF(F11<>\"\",VLOOKUP(F11,SIR_NUM,2,FALSE),\"\")","v":""},{"$f":"IF(H11<>\"\",VLOOKUP(H11,SIR_NUM,2,FALSE),\"\")","v":""}]
[]
[]
["Cefazolin (systemic)"]
["Isolate","Organism","Result 1",null,"Result 2",null,"Result 3",null,"Interpretation Mode or Median","Result 1","Result 2","Result 3","Mode","Result 1","Result 2","Result 3",null,null,"N","%","N Results Total"]
[null,null,"Intials, Date Tested","Interp","Intials, Date Tested","Interp","Intials, Date Tested","Interp",null,"Equivalency","Equivalency","Equivalency","Interp","Interp","Interp","Interp",null,"Category Equivalency",{"$f":"COUNTIF(J17:L21,\"Yes\")","v":0},{"$f":"IF(U16>0, S16/U16,\"\")","v":""},{"$f":"COUNTIF(J17:L21,\"Yes\")+COUNTIF(J17:L21,\"No\")","v":0}]
[null,null,null,null,null,null,null,null,{"$f":"IF(M17<>\"\",VLOOKUP(M17,NUM_SIR,2, FALSE),\"\")","v":""},{"$f":"IF(AND($M17<>\"\",N17<>\"\"),IF(N17=$M17, \"Yes\",\"No\"),\"\")","v":""},{"$f":"IF(AND($M17<>\"\",O17<>\"\"),IF(O17=$M17, \"Yes\",\"No\"),\"\")","v":""},{"$f":"IF(AND($M17<>\"\",P17<>\"\"),IF(P17=$M17, \"Yes\",\"No\"),\"\")","v":""},{"$f":"IF(SUM(N17:P17)>0,IF(ISERROR(MODE(N17:P17)),MEDIAN(N17:P17),MODE(N17:P17)),\"\")","v":""},{"$f":"IF(D17<>\"\",VLOOKUP(D17,SIR_NUM,2,FALSE),\"\")","v":""},{"$f":"IF(F17<>\"\",VLOOKUP(F17,SIR_NUM,2,FALSE),\"\")","v":""},{"$f":"IF(H17<>\"\",VLOOKUP(H17,SIR_NUM,2,FALSE),\"\")","v":""}]
[null,null,null,null,null,null,null,null,{"$f":"IF(M18<>\"\",VLOOKUP(M18,NUM_SIR,2, FALSE),\"\")","v":""},"","","",{"$f":"IF(SUM(N18:P18)>0,IF(ISERROR(MODE(N18:P18)),MEDIAN(N18:P18),MODE(N18:P18)),\"\")","v":""},{"$f":"IF(D18<>\"\",VLOOKUP(D18,SIR_NUM,2,FALSE),\"\")","v":""},{"$f":"IF(F18<>\"\",VLOOKUP(F18,SIR_NUM,2,FALSE),\"\")","v":""},{"$f":"IF(H18<>\"\",VLOOKUP(H18,SIR_NUM,2,FALSE),\"\")","v":""},null,0]
[null,null,null,null,null,null,null,null,{"$f":"IF(M19<>\"\",VLOOKUP(M19,NUM_SIR,2, FALSE),\"\")","v":""},"","","",{"$f":"IF(SUM(N19:P19)>0,IF(ISERROR(MODE(N19:P19)),MEDIAN(N19:P19),MODE(N19:P19)),\"\")","v":""},{"$f":"IF(D19<>\"\",VLOOKUP(D19,SIR_NUM,2,FALSE),\"\")","v":""},{"$f":"IF(F19<>\"\",VLOOKUP(F19,SIR_NUM,2,FALSE),\"\")","v":""},{"$f":"IF(H19<>\"\",VLOOKUP(H19,SIR_NUM,2,FALSE),\"\")","v":""}]
[null,null,null,null,null,null,null,null,{"$f":"IF(M20<>\"\",VLOOKUP(M20,NUM_SIR,2, FALSE),\"\")","v":""},"","","",{"$f":"IF(SUM(N20:P20)>0,IF(ISERROR(MODE(N20:P20)),MEDIAN(N20:P20),MODE(N20:P20)),\"\")","v":""},{"$f":"IF(D20<>\"\",VLOOKUP(D20,SIR_NUM,2,FALSE),\"\")","v":""},{"$f":"IF(F20<>\"\",VLOOKUP(F20,SIR_NUM,2,FALSE),\"\")","v":""},{"$f":"IF(H20<>\"\",VLOOKUP(H20,SIR_NUM,2,FALSE),\"\")","v":""}]
[null,null,null,null,null,null,null,null,{"$f":"IF(M21<>\"\",VLOOKUP(M21,NUM_SIR,2, FALSE),\"\")","v":""},"","","",{"$f":"IF(SUM(N21:P21)>0,IF(ISERROR(MODE(N21:P21)),MEDIAN(N21:P21),MODE(N21:P21)),\"\")","v":""},{"$f":"IF(D21<>\"\",VLOOKUP(D21,SIR_NUM,2,FALSE),\"\")","v":""},{"$f":"IF(F21<>\"\",VLOOKUP(F21,SIR_NUM,2,FALSE),\"\")","v":""},{"$f":"IF(H21<>\"\",VLOOKUP(H21,SIR_NUM,2,FALSE),\"\")","v":""}]
[]
[]
["Cefepime"]
["Isolate","Organism","Result 1",null,"Result 2",null,"Result 3",null,"Interpretation Mode or Median","Result 1","Result 2","Result 3","Mode","Result 1","Result 2","Result 3",null,null,"N","%","N Results Total"]
[null,null,"Intials, Date Tested","Interp","Intials, Date Tested","Interp","Intials, Date Tested","Interp",null,"Equivalency","Equivalency","Equivalency","Interp","Interp","Interp","Interp",null,"Category Equivalency",{"$f":"COUNTIF(J27:L31,\"Yes\")","v":0},{"$f":"IF(U26>0, S26/U26,\"\")","v":""},{"$f":"COUNTIF(J27:L31,\"Yes\")+COUNTIF(J27:L31,\"No\")","v":0}]
[null,null,null,null,null,null,null,null,{"$f":"IF(M27<>\"\",VLOOKUP(M27,NUM_SDD,2, FALSE),\"\")","v":""},{"$f":"IF(AND($M27<>\"\",N27<>\"\"),IF(N27=$M27, \"Yes\",\"No\"),\"\")","v":""},"","",{"$f":"IF(SUM(N27:P27)>0,IF(ISERROR(MODE(N27:P27)),MEDIAN(N27:P27),MODE(N27:P27)),\"\")","v":""},{"$f":"IF(D27<>\"\",VLOOKUP(D27,SDD_NUM,2,FALSE),\"\")","v":""},{"$f":"IF(F27<>\"\",VLOOKUP(F27,SDD_NUM,2,FALSE),\"\")","v":""},{"$f":"IF(H27<>\"\",VLOOKUP(H27,SDD_NUM,2,FALSE),\"\")","v":""}]
[null,null,null,null,null,null,null,null,{"$f":"IF(M28<>\"\",VLOOKUP(M28,NUM_SDD,2, FALSE),\"\")","v":""},"","","",{"$f":"IF(SUM(N28:P28)>0,IF(ISERROR(MODE(N28:P28)),MEDIAN(N28:P28),MODE(N28:P28)),\"\")","v":""},{"$f":"IF(D28<>\"\",VLOOKUP(D28,SDD_NUM,2,FALSE),\"\")","v":""},{"$f":"IF(F28<>\"\",VLOOKUP(F28,SDD_NUM,2,FALSE),\"\")","v":""},{"$f":"IF(H28<>\"\",VLOOKUP(H28,SDD_NUM,2,FALSE),\"\")","v":""},null,0]
[null,null,null,null,null,null,null,null,{"$f":"IF(M29<>\"\",VLOOKUP(M29,NUM_SDD,2, FALSE),\"\")","v":""},"","","",{"$f":"IF(SUM(N29:P29)>0,IF(ISERROR(MODE(N29:P29)),MEDIAN(N29:P29),MODE(N29:P29)),\"\")","v":""},{"$f":"IF(D29<>\"\",VLOOKUP(D29,SDD_NUM,2,FALSE),\"\")","v":""},{"$f":"IF(F29<>\"\",VLOOKUP(F29,SDD_NUM,2,FALSE),\"\")","v":""},{"$f":"IF(H29<>\"\",VLOOKUP(H29,SDD_NUM,2,FALSE),\"\")","v":""}]
[null,null,null,null,null,null,null,null,{"$f":"IF(M30<>\"\",VLOOKUP(M30,NUM_SDD,2, FALSE),\"\")","v":""},"","","",{"$f":"IF(SUM(N30:P30)>0,IF(ISERROR(MODE(N30:P30)),MEDIAN(N30:P30),MODE(N30:P30)),\"\")","v":""},{"$f":"IF(D30<>\"\",VLOOKUP(D30,SDD_NUM,2,FALSE),\"\")","v":""},{"$f":"IF(F30<>\"\",VLOOKUP(F30,SDD_NUM,2,FALSE),\"\")","v":""},{"$f":"IF(H30<>\"\",VLOOKUP(H30,SDD_NUM,2,FALSE),\"\")","v":""}]
[null,null,null,null,null,null,null,null,{"$f":"IF(M31<>\"\",VLOOKUP(M31,NUM_SDD,2, FALSE),\"\")","v":""},"","","",{"$f":"IF(SUM(N31:P31)>0,IF(ISERROR(MODE(N31:P31)),MEDIAN(N31:P31),MODE(N31:P31)),\"\")","v":""},{"$f":"IF(D31<>\"\",VLOOKUP(D31,SDD_NUM,2,FALSE),\"\")","v":""},{"$f":"IF(F31<>\"\",VLOOKUP(F31,SDD_NUM,2,FALSE),\"\")","v":""},{"$f":"IF(H31<>\"\",VLOOKUP(H31,SDD_NUM,2,FALSE),\"\")","v":""}]
[]
[]
["Cefotaxime"]
["Isolate","Organism","Result 1",null,"Result 2",null,"Result 3",null,"Interpretation Mode or Median","Result 1","Result 2","Result 3","Mode","Result 1","Result 2","Result 3",null,null,"N","%","N Results Total"]
[null,null,"Intials, Date Tested","Interp","Intials, Date Tested","Interp","Intials, Date Tested","Interp",null,"Equivalency","Equivalency","Equivalency","Interp","Interp","Interp","Interp",null,"Category Equivalency",{"$f":"COUNTIF(J37:L41,\"Yes\")","v":0},{"$f":"IF(U36>0, S36/U36,\"\")","v":""},{"$f":"COUNTIF(J37:L41,\"Yes\")+COUNTIF(J37:L41,\"No\")","v":0}]
[null,null,null,null,null,null,null,null,{"$f":"IF(M37<>\"\",VLOOKUP(M37,NUM_SIR,2, FALSE),\"\")","v":""},{"$f":"IF(AND($M37<>\"\",N37<>\"\"),IF(N37=$M37, \"Yes\",\"No\"),\"\")","v":""},{"$f":"IF(AND($M37<>\"\",O37<>\"\"),IF(O37=$M37, \"Yes\",\"No\"),\"\")","v":""},{"$f":"IF(AND($M37<>\"\",P37<>\"\"),IF(P37=$M37, \"Yes\",\"No\"),\"\")","v":""},{"$f":"IF(SUM(N37:P37)>0,IF(ISERROR(MODE(N37:P37)),MEDIAN(N37:P37),MODE(N37:P37)),\"\")","v":""},{"$f":"IF(D37<>\"\",VLOOKUP(D37,SIR_NUM,2,FALSE),\"\")","v":""},{"$f":"IF(F37<>\"\",VLOOKUP(F37,SIR_NUM,2,FALSE),\"\")","v":""},{"$f":"IF(H37<>\"\",VLOOKUP(H37,SIR_NUM,2,FALSE),\"\")","v":""}]
[null,null,null,null,null,null,null,null,{"$f":"IF(M38<>\"\",VLOOKUP(M38,NUM_SIR,2, FALSE),\"\")","v":""},"","","",{"$f":"IF(SUM(N38:P38)>0,IF(ISERROR(MODE(N38:P38)),MEDIAN(N38:P38),MODE(N38:P38)),\"\")","v":""},{"$f":"IF(D38<>\"\",VLOOKUP(D38,SIR_NUM,2,FALSE),\"\")","v":""},{"$f":"IF(F38<>\"\",VLOOKUP(F38,SIR_NUM,2,FALSE),\"\")","v":""},{"$f":"IF(H38<>\"\",VLOOKUP(H38,SIR_NUM,2,FALSE),\"\")","v":""},null,0]
[null,null,null,null,null,null,null,null,{"$f":"IF(M39<>\"\",VLOOKUP(M39,NUM_SIR,2, FALSE),\"\")","v":""},"","","",{"$f":"IF(SUM(N39:P39)>0,IF(ISERROR(MODE(N39:P39)),MEDIAN(N39:P39),MODE(N39:P39)),\"\")","v":""},{"$f":"IF(D39<>\"\",VLOOKUP(D39,SIR_NUM,2,FALSE),\"\")","v":""},{"$f":"IF(F39<>\"\",VLOOKUP(F39,SIR_NUM,2,FALSE),\"\")","v":""},{"$f":"IF(H39<>\"\",VLOOKUP(H39,SIR_NUM,2,FALSE),\"\")","v":""}]
[null,null,null,null,null,null,null,null,{"$f":"IF(M40<>\"\",VLOOKUP(M40,NUM_SIR,2, FALSE),\"\")","v":""},"","","",{"$f":"IF(SUM(N40:P40)>0,IF(ISERROR(MODE(N40:P40)),MEDIAN(N40:P40),MODE(N40:P40)),\"\")","v":""},{"$f":"IF(D40<>\"\",VLOOKUP(D40,SIR_NUM,2,FALSE),\"\")","v":""},{"$f":"IF(F40<>\"\",VLOOKUP(F40,SIR_NUM,2,FALSE),\"\")","v":""},{"$f":"IF(H40<>\"\",VLOOKUP(H40,SIR_NUM,2,FALSE),\"\")","v":""}]
[null,null,null,null,null,null,null,null,{"$f":"IF(M41<>\"\",VLOOKUP(M41,NUM_SIR,2, FALSE),\"\")","v":""},"","","",{"$f":"IF(SUM(N41:P41)>0,IF(ISERROR(MODE(N41:P41)),MEDIAN(N41:P41),MODE(N41:P41)),\"\")","v":""},{"$f":"IF(D41<>\"\",VLOOKUP(D41,SIR_NUM,2,FALSE),\"\")","v":""},{"$f":"IF(F41<>\"\",VLOOKUP(F41,SIR_NUM,2,FALSE),\"\")","v":""},{"$f":"IF(H41<>\"\",VLOOKUP(H41,SIR_NUM,2,FALSE),\"\")","v":""}]
[]
[]
["Ceftazidime"]
["Isolate","Organism","Result 1",null,"Result 2",null,"Result 3",null,"Interpretation Mode or Median","Result 1","Result 2","Result 3","Mode","Result 1","Result 2","Result 3",null,null,"N","%","N Results Total"]
[null,null,"Intials, Date Tested","Interp","Intials, Date Tested","Interp","Intials, Date Tested","Interp",null,"Equivalency","Equivalency","Equivalency","Interp","Interp","Interp","Interp",null,"Category Equivalency",{"$f":"COUNTIF(J47:L51,\"Yes\")","v":0},{"$f":"IF(U46>0, S46/U46,\"\")","v":""},{"$f":"COUNTIF(J47:L51,\"Yes\")+COUNTIF(J47:L51,\"No\")","v":0}]
[null,null,null,null,null,null,null,null,{"$f":"IF(M47<>\"\",VLOOKUP(M47,NUM_SIR,2, FALSE),\"\")","v":""},{"$f":"IF(AND($M47<>\"\",N47<>\"\"),IF(N47=$M47, \"Yes\",\"No\"),\"\")","v":""},{"$f":"IF(AND($M47<>\"\",O47<>\"\"),IF(O47=$M47, \"Yes\",\"No\"),\"\")","v":""},{"$f":"IF(AND($M47<>\"\",P47<>\"\"),IF(P47=$M47, \"Yes\",\"No\"),\"\")","v":""},{"$f":"IF(SUM(N47:P47)>0,IF(ISERROR(MODE(N47:P47)),MEDIAN(N47:P47),MODE(N47:P47)),\"\")","v":""},{"$f":"IF(D47<>\"\",VLOOKUP(D47,SIR_NUM,2,FALSE),\"\")","v":""},{"$f":"IF(F47<>\"\",VLOOKUP(F47,SIR_NUM,2,FALSE),\"\")","v":""},{"$f":"IF(H47<>\"\",VLOOKUP(H47,SIR_NUM,2,FALSE),\"\")","v":""}]
[null,null,null,null,null,null,null,null,{"$f":"IF(M48<>\"\",VLOOKUP(M48,NUM_SIR,2, FALSE),\"\")","v":""},"","","",{"$f":"IF(SUM(N48:P48)>0,IF(ISERROR(MODE(N48:P48)),MEDIAN(N48:P48),MODE(N48:P48)),\"\")","v":""},{"$f":"IF(D48<>\"\",VLOOKUP(D48,SIR_NUM,2,FALSE),\"\")","v":""},{"$f":"IF(F48<>\"\",VLOOKUP(F48,SIR_NUM,2,FALSE),\"\")","v":""},{"$f":"IF(H48<>\"\",VLOOKUP(H48,SIR_NUM,2,FALSE),\"\")","v":""},null,0]
[null,null,null,null,null,null,null,null,{"$f":"IF(M49<>\"\",VLOOKUP(M49,NUM_SIR,2, FALSE),\"\")","v":""},"","","",{"$f":"IF(SUM(N49:P49)>0,IF(ISERROR(MODE(N49:P49)),MEDIAN(N49:P49),MODE(N49:P49)),\"\")","v":""},{"$f":"IF(D49<>\"\",VLOOKUP(D49,SIR_NUM,2,FALSE),\"\")","v":""},{"$f":"IF(F49<>\"\",VLOOKUP(F49,SIR_NUM,2,FALSE),\"\")","v":""},{"$f":"IF(H49<>\"\",VLOOKUP(H49,SIR_NUM,2,FALSE),\"\")","v":""}]
[null,null,null,null,null,null,null,null,{"$f":"IF(M50<>\"\",VLOOKUP(M50,NUM_SIR,2, FALSE),\"\")","v":""},"","","",{"$f":"IF(SUM(N50:P50)>0,IF(ISERROR(MODE(N50:P50)),MEDIAN(N50:P50),MODE(N50:P50)),\"\")","v":""},{"$f":"IF(D50<>\"\",VLOOKUP(D50,SIR_NUM,2,FALSE),\"\")","v":""},{"$f":"IF(F50<>\"\",VLOOKUP(F50,SIR_NUM,2,FALSE),\"\")","v":""},{"$f":"IF(H50<>\"\",VLOOKUP(H50,SIR_NUM,2,FALSE),\"\")","v":""}]
[null,null,null,null,null,null,null,null,{"$f":"IF(M51<>\"\",VLOOKUP(M51,NUM_SIR,2, FALSE),\"\")","v":""},"","","",{"$f":"IF(SUM(N51:P51)>0,IF(ISERROR(MODE(N51:P51)),MEDIAN(N51:P51),MODE(N51:P51)),\"\")","v":""},{"$f":"IF(D51<>\"\",VLOOKUP(D51,SIR_NUM,2,FALSE),\"\")","v":""},{"$f":"IF(F51<>\"\",VLOOKUP(F51,SIR_NUM,2,FALSE),\"\")","v":""},{"$f":"IF(H51<>\"\",VLOOKUP(H51,SIR_NUM,2,FALSE),\"\")","v":""}]
[]
[]
["Ceftriaxone"]
["Isolate","Organism","Result 1",null,"Result 2",null,"Result 3",null,"Interpretation Mode or Median","Result 1","Result 2","Result 3","Mode","Result 1","Result 2","Result 3",null,null,"N","%","N Results Total"]
[null,null,"Intials, Date Tested","Interp","Intials, Date Tested","Interp","Intials, Date Tested","Interp",null,"Equivalency","Equivalency","Equivalency","Interp","Interp","Interp","Interp",null,"Category Equivalency",{"$f":"COUNTIF(J57:L61,\"Yes\")","v":0},{"$f":"IF(U56>0, S56/U56,\"\")","v":""},{"$f":"COUNTIF(J57:L61,\"Yes\")+COUNTIF(J57:L61,\"No\")","v":0}]
[null,null,null,null,null,null,null,null,{"$f":"IF(M57<>\"\",VLOOKUP(M57,NUM_SIR,2, FALSE),\"\")","v":""},{"$f":"IF(AND($M57<>\"\",N57<>\"\"),IF(N57=$M57, \"Yes\",\"No\"),\"\")","v":""},{"$f":"IF(AND($M57<>\"\",O57<>\"\"),IF(O57=$M57, \"Yes\",\"No\"),\"\")","v":""},{"$f":"IF(AND($M57<>\"\",P57<>\"\"),IF(P57=$M57, \"Yes\",\"No\"),\"\")","v":""},{"$f":"IF(SUM(N57:P57)>0,IF(ISERROR(MODE(N57:P57)),MEDIAN(N57:P57),MODE(N57:P57)),\"\")","v":""},{"$f":"IF(D57<>\"\",VLOOKUP(D57,SIR_NUM,2,FALSE),\"\")","v":""},{"$f":"IF(F57<>\"\",VLOOKUP(F57,SIR_NUM,2,FALSE),\"\")","v":""},{"$f":"IF(H57<>\"\",VLOOKUP(H57,SIR_NUM,2,FALSE),\"\")","v":""}]
[null,null,null,null,null,null,null,null,{"$f":"IF(M58<>\"\",VLOOKUP(M58,NUM_SIR,2, FALSE),\"\")","v":""},"","","",{"$f":"IF(SUM(N58:P58)>0,IF(ISERROR(MODE(N58:P58)),MEDIAN(N58:P58),MODE(N58:P58)),\"\")","v":""},{"$f":"IF(D58<>\"\",VLOOKUP(D58,SIR_NUM,2,FALSE),\"\")","v":""},{"$f":"IF(F58<>\"\",VLOOKUP(F58,SIR_NUM,2,FALSE),\"\")","v":""},{"$f":"IF(H58<>\"\",VLOOKUP(H58,SIR_NUM,2,FALSE),\"\")","v":""},null,0]
[null,null,null,null,null,null,null,null,{"$f":"IF(M59<>\"\",VLOOKUP(M59,NUM_SIR,2, FALSE),\"\")","v":""},"","","",{"$f":"IF(SUM(N59:P59)>0,IF(ISERROR(MODE(N59:P59)),MEDIAN(N59:P59),MODE(N59:P59)),\"\")","v":""},{"$f":"IF(D59<>\"\",VLOOKUP(D59,SIR_NUM,2,FALSE),\"\")","v":""},{"$f":"IF(F59<>\"\",VLOOKUP(F59,SIR_NUM,2,FALSE),\"\")","v":""},{"$f":"IF(H59<>\"\",VLOOKUP(H59,SIR_NUM,2,FALSE),\"\")","v":""}]
[null,null,null,null,null,null,null,null,{"$f":"IF(M60<>\"\",VLOOKUP(M60,NUM_SIR,2, FALSE),\"\")","v":""},"","","",{"$f":"IF(SUM(N60:P60)>0,IF(ISERROR(MODE(N60:P60)),MEDIAN(N60:P60),MODE(N60:P60)),\"\")","v":""},{"$f":"IF(D60<>\"\",VLOOKUP(D60,SIR_NUM,2,FALSE),\"\")","v":""},{"$f":"IF(F60<>\"\",VLOOKUP(F60,SIR_NUM,2,FALSE),\"\")","v":""},{"$f":"IF(H60<>\"\",VLOOKUP(H60,SIR_NUM,2,FALSE),\"\")","v":""}]
[null,null,null,null,null,null,null,null,{"$f":"IF(M61<>\"\",VLOOKUP(M61,NUM_SIR,2, FALSE),\"\")","v":""},"","","",{"$f":"IF(SUM(N61:P61)>0,IF(ISERROR(MODE(N61:P61)),MEDIAN(N61:P61),MODE(N61:P61)),\"\")","v":""},{"$f":"IF(D61<>\"\",VLOOKUP(D61,SIR_NUM,2,FALSE),\"\")","v":""},{"$f":"IF(F61<>\"\",VLOOKUP(F61,SIR_NUM,2,FALSE),\"\")","v":""},{"$f":"IF(H61<>\"\",VLOOKUP(H61,SIR_NUM,2,FALSE),\"\")","v":""}]
[]
[]
["Ciprofloxacin"]
["Isolate","Organism","Result 1",null,"Result 2",null,"Result 3",null,"Interpretation Mode or Median","Result 1","Result 2","Result 3","Mode","Result 1","Result 2","Result 3",null,null,"N","%","N Results Total"]
[null,null,"Intials, Date Tested","Interp","Intials, Date Tested","Interp","Intials, Date Tested","Interp",null,"Equivalency","Equivalency","Equivalency","Interp","Interp","Interp","Interp",null,"Category Equivalency",{"$f":"COUNTIF(J67:L71,\"Yes\")","v":0},{"$f":"IF(U66>0, S66/U66,\"\")","v":""},{"$f":"COUNTIF(J67:L71,\"Yes\")+COUNTIF(J67:L71,\"No\")","v":0}]
[null,null,null,null,null,null,null,null,{"$f":"IF(M67<>\"\",VLOOKUP(M67,NUM_SIR,2, FALSE),\"\")","v":""},{"$f":"IF(AND($M67<>\"\",N67<>\"\"),IF(N67=$M67, \"Yes\",\"No\"),\"\")","v":""},{"$f":"IF(AND($M67<>\"\",O67<>\"\"),IF(O67=$M67, \"Yes\",\"No\"),\"\")","v":""},{"$f":"IF(AND($M67<>\"\",P67<>\"\"),IF(P67=$M67, \"Yes\",\"No\"),\"\")","v":""},{"$f":"IF(SUM(N67:P67)>0,IF(ISERROR(MODE(N67:P67)),MEDIAN(N67:P67),MODE(N67:P67)),\"\")","v":""},{"$f":"IF(D67<>\"\",VLOOKUP(D67,SIR_NUM,2,FALSE),\"\")","v":""},{"$f":"IF(F67<>\"\",VLOOKUP(F67,SIR_NUM,2,FALSE),\"\")","v":""},{"$f":"IF(H67<>\"\",VLOOKUP(H67,SIR_NUM,2,FALSE),\"\")","v":""}]
[null,null,null,null,null,null,null,null,{"$f":"IF(M68<>\"\",VLOOKUP(M68,NUM_SIR,2, FALSE),\"\")","v":""},"","","",{"$f":"IF(SUM(N68:P68)>0,IF(ISERROR(MODE(N68:P68)),MEDIAN(N68:P68),MODE(N68:P68)),\"\")","v":""},{"$f":"IF(D68<>\"\",VLOOKUP(D68,SIR_NUM,2,FALSE),\"\")","v":""},{"$f":"IF(F68<>\"\",VLOOKUP(F68,SIR_NUM,2,FALSE),\"\")","v":""},{"$f":"IF(H68<>\"\",VLOOKUP(H68,SIR_NUM,2,FALSE),\"\")","v":""},null,0]
[null,null,null,null,null,null,null,null,{"$f":"IF(M69<>\"\",VLOOKUP(M69,NUM_SIR,2, FALSE),\"\")","v":""},"","","",{"$f":"IF(SUM(N69:P69)>0,IF(ISERROR(MODE(N69:P69)),MEDIAN(N69:P69),MODE(N69:P69)),\"\")","v":""},{"$f":"IF(D69<>\"\",VLOOKUP(D69,SIR_NUM,2,FALSE),\"\")","v":""},{"$f":"IF(F69<>\"\",VLOOKUP(F69,SIR_NUM,2,FALSE),\"\")","v":""},{"$f":"IF(H69<>\"\",VLOOKUP(H69,SIR_NUM,2,FALSE),\"\")","v":""}]
[null,null,null,null,null,null,null,null,{"$f":"IF(M70<>\"\",VLOOKUP(M70,NUM_SIR,2, FALSE),\"\")","v":""},"","","",{"$f":"IF(SUM(N70:P70)>0,IF(ISERROR(MODE(N70:P70)),MEDIAN(N70:P70),MODE(N70:P70)),\"\")","v":""},{"$f":"IF(D70<>\"\",VLOOKUP(D70,SIR_NUM,2,FALSE),\"\")","v":""},{"$f":"IF(F70<>\"\",VLOOKUP(F70,SIR_NUM,2,FALSE),\"\")","v":""},{"$f":"IF(H70<>\"\",VLOOKUP(H70,SIR_NUM,2,FALSE),\"\")","v":""}]
[null,null,null,null,null,null,null,null,{"$f":"IF(M71<>\"\",VLOOKUP(M71,NUM_SIR,2, FALSE),\"\")","v":""},"","","",{"$f":"IF(SUM(N71:P71)>0,IF(ISERROR(MODE(N71:P71)),MEDIAN(N71:P71),MODE(N71:P71)),\"\")","v":""},{"$f":"IF(D71<>\"\",VLOOKUP(D71,SIR_NUM,2,FALSE),\"\")","v":""},{"$f":"IF(F71<>\"\",VLOOKUP(F71,SIR_NUM,2,FALSE),\"\")","v":""},{"$f":"IF(H71<>\"\",VLOOKUP(H71,SIR_NUM,2,FALSE),\"\")","v":""}]
[]
[]
["Ertapenem"]
["Isolate","Organism","Result 1",null,"Result 2",null,"Result 3",null,"Interpretation Mode or Median","Result 1","Result 2","Result 3","Mode","Result 1","Result 2","Result 3",null,null,"N","%","N Results Total"]
[null,null,"Intials, Date Tested","Interp","Intials, Date Tested","Interp","Intials, Date Tested","Interp",null,"Equivalency","Equivalency","Equivalency","Interp","Interp","Interp","Interp",null,"Category Equivalency",{"$f":"COUNTIF(J77:L81,\"Yes\")","v":0},{"$f":"IF(U76>0, S76/U76,\"\")","v":""},{"$f":"COUNTIF(J77:L81,\"Yes\")+COUNTIF(J77:L81,\"No\")","v":0}]
[null,null,null,null,null,null,null,null,{"$f":"IF(M77<>\"\",VLOOKUP(M77,NUM_SIR,2, FALSE),\"\")","v":""},{"$f":"IF(AND($M77<>\"\",N77<>\"\"),IF(N77=$M77, \"Yes\",\"No\"),\"\")","v":""},{"$f":"IF(AND($M77<>\"\",O77<>\"\"),IF(O77=$M77, \"Yes\",\"No\"),\"\")","v":""},{"$f":"IF(AND($M77<>\"\",P77<>\"\"),IF(P77=$M77, \"Yes\",\"No\"),\"\")","v":""},{"$f":"IF(SUM(N77:P77)>0,IF(ISERROR(MODE(N77:P77)),MEDIAN(N77:P77),MODE(N77:P77)),\"\")","v":""},{"$f":"IF(D77<>\"\",VLOOKUP(D77,SIR_NUM,2,FALSE),\"\")","v":""},{"$f":"IF(F77<>\"\",VLOOKUP(F77,SIR_NUM,2,FALSE),\"\")","v":""},{"$f":"IF(H77<>\"\",VLOOKUP(H77,SIR_NUM,2,FALSE),\"\")","v":""}]
[null,null,null,null,null,null,null,null,{"$f":"IF(M78<>\"\",VLOOKUP(M78,NUM_SIR,2, FALSE),\"\")","v":""},"","","",{"$f":"IF(SUM(N78:P78)>0,IF(ISERROR(MODE(N78:P78)),MEDIAN(N78:P78),MODE(N78:P78)),\"\")","v":""},{"$f":"IF(D78<>\"\",VLOOKUP(D78,SIR_NUM,2,FALSE),\"\")","v":""},{"$f":"IF(F78<>\"\",VLOOKUP(F78,SIR_NUM,2,FALSE),\"\")","v":""},{"$f":"IF(H78<>\"\",VLOOKUP(H78,SIR_NUM,2,FALSE),\"\")","v":""},null,0]
[null,null,null,null,null,null,null,null,{"$f":"IF(M79<>\"\",VLOOKUP(M79,NUM_SIR,2, FALSE),\"\")","v":""},"","","",{"$f":"IF(SUM(N79:P79)>0,IF(ISERROR(MODE(N79:P79)),MEDIAN(N79:P79),MODE(N79:P79)),\"\")","v":""},{"$f":"IF(D79<>\"\",VLOOKUP(D79,SIR_NUM,2,FALSE),\"\")","v":""},{"$f":"IF(F79<>\"\",VLOOKUP(F79,SIR_NUM,2,FALSE),\"\")","v":""},{"$f":"IF(H79<>\"\",VLOOKUP(H79,SIR_NUM,2,FALSE),\"\")","v":""}]
[null,null,null,null,null,null,null,null,{"$f":"IF(M80<>\"\",VLOOKUP(M80,NUM_SIR,2, FALSE),\"\")","v":""},"","","",{"$f":"IF(SUM(N80:P80)>0,IF(ISERROR(MODE(N80:P80)),MEDIAN(N80:P80),MODE(N80:P80)),\"\")","v":""},{"$f":"IF(D80<>\"\",VLOOKUP(D80,SIR_NUM,2,FALSE),\"\")","v":""},{"$f":"IF(F80<>\"\",VLOOKUP(F80,SIR_NUM,2,FALSE),\"\")","v":""},{"$f":"IF(H80<>\"\",VLOOKUP(H80,SIR_NUM,2,FALSE),\"\")","v":""}]
[null,null,null,null,null,null,null,null,{"$f":"IF(M81<>\"\",VLOOKUP(M81,NUM_SIR,2, FALSE),\"\")","v":""},"","","",{"$f":"IF(SUM(N81:P81)>0,IF(ISERROR(MODE(N81:P81)),MEDIAN(N81:P81),MODE(N81:P81)),\"\")","v":""},{"$f":"IF(D81<>\"\",VLOOKUP(D81,SIR_NUM,2,FALSE),\"\")","v":""},{"$f":"IF(F81<>\"\",VLOOKUP(F81,SIR_NUM,2,FALSE),\"\")","v":""},{"$f":"IF(H81<>\"\",VLOOKUP(H81,SIR_NUM,2,FALSE),\"\")","v":""}]
[]
[]
["Imipenem"]
["Isolate","Organism","Result 1",null,"Result 2",null,"Result 3",null,"Interpretation Mode or Median","Result 1","Result 2","Result 3","Mode","Result 1","Result 2","Result 3",null,null,"N","%","N Results Total"]
[null,null,"Intials, Date Tested","Interp","Intials, Date Tested","Interp","Intials, Date Tested","Interp",null,"Equivalency","Equivalency","Equivalency","Interp","Interp","Interp","Interp",null,"Category Equivalency",{"$f":"COUNTIF(J87:L91,\"Yes\")","v":0},{"$f":"IF(U86>0, S86/U86,\"\")","v":""},{"$f":"COUNTIF(J87:L91,\"Yes\")+COUNTIF(J87:L91,\"No\")","v":0}]
[null,null,null,null,null,null,null,null,{"$f":"IF(M87<>\"\",VLOOKUP(M87,NUM_SIR,2, FALSE),\"\")","v":""},{"$f":"IF(AND($M87<>\"\",N87<>\"\"),IF(N87=$M87, \"Yes\",\"No\"),\"\")","v":""},{"$f":"IF(AND($M87<>\"\",O87<>\"\"),IF(O87=$M87, \"Yes\",\"No\"),\"\")","v":""},{"$f":"IF(AND($M87<>\"\",P87<>\"\"),IF(P87=$M87, \"Yes\",\"No\"),\"\")","v":""},{"$f":"IF(SUM(N87:P87)>0,IF(ISERROR(MODE(N87:P87)),MEDIAN(N87:P87),MODE(N87:P87)),\"\")","v":""},{"$f":"IF(D87<>\"\",VLOOKUP(D87,SIR_NUM,2,FALSE),\"\")","v":""},{"$f":"IF(F87<>\"\",VLOOKUP(F87,SIR_NUM,2,FALSE),\"\")","v":""},{"$f":"IF(H87<>\"\",VLOOKUP(H87,SIR_NUM,2,FALSE),\"\")","v":""}]
[null,null,null,null,null,null,null,null,{"$f":"IF(M88<>\"\",VLOOKUP(M88,NUM_SIR,2, FALSE),\"\")","v":""},"","","",{"$f":"IF(SUM(N88:P88)>0,IF(ISERROR(MODE(N88:P88)),MEDIAN(N88:P88),MODE(N88:P88)),\"\")","v":""},{"$f":"IF(D88<>\"\",VLOOKUP(D88,SIR_NUM,2,FALSE),\"\")","v":""},{"$f":"IF(F88<>\"\",VLOOKUP(F88,SIR_NUM,2,FALSE),\"\")","v":""},{"$f":"IF(H88<>\"\",VLOOKUP(H88,SIR_NUM,2,FALSE),\"\")","v":""},null,0]
[null,null,null,null,null,null,null,null,{"$f":"IF(M89<>\"\",VLOOKUP(M89,NUM_SIR,2, FALSE),\"\")","v":""},"","","",{"$f":"IF(SUM(N89:P89)>0,IF(ISERROR(MODE(N89:P89)),MEDIAN(N89:P89),MODE(N89:P89)),\"\")","v":""},{"$f":"IF(D89<>\"\",VLOOKUP(D89,SIR_NUM,2,FALSE),\"\")","v":""},{"$f":"IF(F89<>\"\",VLOOKUP(F89,SIR_NUM,2,FALSE),\"\")","v":""},{"$f":"IF(H89<>\"\",VLOOKUP(H89,SIR_NUM,2,FALSE),\"\")","v":""}]
[null,null,null,null,null,null,null,null,{"$f":"IF(M90<>\"\",VLOOKUP(M90,NUM_SIR,2, FALSE),\"\")","v":""},"","","",{"$f":"IF(SUM(N90:P90)>0,IF(ISERROR(MODE(N90:P90)),MEDIAN(N90:P90),MODE(N90:P90)),\"\")","v":""},{"$f":"IF(D90<>\"\",VLOOKUP(D90,SIR_NUM,2,FALSE),\"\")","v":""},{"$f":"IF(F90<>\"\",VLOOKUP(F90,SIR_NUM,2,FALSE),\"\")","v":""},{"$f":"IF(H90<>\"\",VLOOKUP(H90,SIR_NUM,2,FALSE),\"\")","v":""}]
[null,null,null,null,null,null,null,null,{"$f":"IF(M91<>\"\",VLOOKUP(M91,NUM_SIR,2, FALSE),\"\")","v":""},"","","",{"$f":"IF(SUM(N91:P91)>0,IF(ISERROR(MODE(N91:P91)),MEDIAN(N91:P91),MODE(N91:P91)),\"\")","v":""},{"$f":"IF(D91<>\"\",VLOOKUP(D91,SIR_NUM,2,FALSE),\"\")","v":""},{"$f":"IF(F91<>\"\",VLOOKUP(F91,SIR_NUM,2,FALSE),\"\")","v":""},{"$f":"IF(H91<>\"\",VLOOKUP(H91,SIR_NUM,2,FALSE),\"\")","v":""}]
[]
[]
["Levofloxacin"]
["Isolate","Organism","Result 1",null,"Result 2",null,"Result 3",null,"Interpretation Mode or Median","Result 1","Result 2","Result 3","Mode","Result 1","Result 2","Result 3",null,null,"N","%","N Results Total"]
[null,null,"Intials, Date Tested","Interp","Intials, Date Tested","Interp","Intials, Date Tested","Interp",null,"Equivalency","Equivalency","Equivalency","Interp","Interp","Interp","Interp",null,"Category Equivalency",{"$f":"COUNTIF(J97:L101,\"Yes\")","v":0},{"$f":"IF(U96>0, S96/U96,\"\")","v":""},{"$f":"COUNTIF(J97:L101,\"Yes\")+COUNTIF(J97:L101,\"No\")","v":0}]
[null,null,null,null,null,null,null,null,{"$f":"IF(M97<>\"\",VLOOKUP(M97,NUM_SIR,2, FALSE),\"\")","v":""},{"$f":"IF(AND($M97<>\"\",N97<>\"\"),IF(N97=$M97, \"Yes\",\"No\"),\"\")","v":""},{"$f":"IF(AND($M97<>\"\",O97<>\"\"),IF(O97=$M97, \"Yes\",\"No\"),\"\")","v":""},{"$f":"IF(AND($M97<>\"\",P97<>\"\"),IF(P97=$M97, \"Yes\",\"No\"),\"\")","v":""},{"$f":"IF(SUM(N97:P97)>0,IF(ISERROR(MODE(N97:P97)),MEDIAN(N97:P97),MODE(N97:P97)),\"\")","v":""},{"$f":"IF(D97<>\"\",VLOOKUP(D97,SIR_NUM,2,FALSE),\"\")","v":""},{"$f":"IF(F97<>\"\",VLOOKUP(F97,SIR_NUM,2,FALSE),\"\")","v":""},{"$f":"IF(H97<>\"\",VLOOKUP(H97,SIR_NUM,2,FALSE),\"\")","v":""}]
[null,null,null,null,null,null,null,null,{"$f":"IF(M98<>\"\",VLOOKUP(M98,NUM_SIR,2, FALSE),\"\")","v":""},"","","",{"$f":"IF(SUM(N98:P98)>0,IF(ISERROR(MODE(N98:P98)),MEDIAN(N98:P98),MODE(N98:P98)),\"\")","v":""},{"$f":"IF(D98<>\"\",VLOOKUP(D98,SIR_NUM,2,FALSE),\"\")","v":""},{"$f":"IF(F98<>\"\",VLOOKUP(F98,SIR_NUM,2,FALSE),\"\")","v":""},{"$f":"IF(H98<>\"\",VLOOKUP(H98,SIR_NUM,2,FALSE),\"\")","v":""},null,0]
[null,null,null,null,null,null,null,null,{"$f":"IF(M99<>\"\",VLOOKUP(M99,NUM_SIR,2, FALSE),\"\")","v":""},"","","",{"$f":"IF(SUM(N99:P99)>0,IF(ISERROR(MODE(N99:P99)),MEDIAN(N99:P99),MODE(N99:P99)),\"\")","v":""},{"$f":"IF(D99<>\"\",VLOOKUP(D99,SIR_NUM,2,FALSE),\"\")","v":""},{"$f":"IF(F99<>\"\",VLOOKUP(F99,SIR_NUM,2,FALSE),\"\")","v":""},{"$f":"IF(H99<>\"\",VLOOKUP(H99,SIR_NUM,2,FALSE),\"\")","v":""}]
[null,null,null,null,null,null,null,null,{"$f":"IF(M100<>\"\",VLOOKUP(M100,NUM_SIR,2, FALSE),\"\")","v":""},"","","",{"$f":"IF(SUM(N100:P100)>0,IF(ISERROR(MODE(N100:P100)),MEDIAN(N100:P100),MODE(N100:P100)),\"\")","v":""},{"$f":"IF(D100<>\"\",VLOOKUP(D100,SIR_NUM,2,FALSE),\"\")","v":""},{"$f":"IF(F100<>\"\",VLOOKUP(F100,SIR_NUM,2,FALSE),\"\")","v":""},{"$f":"IF(H100<>\"\",VLOOKUP(H100,SIR_NUM,2,FALSE),\"\")","v":""}]
[null,null,null,null,null,null,null,null,{"$f":"IF(M101<>\"\",VLOOKUP(M101,NUM_SIR,2, FALSE),\"\")","v":""},"","","",{"$f":"IF(SUM(N101:P101)>0,IF(ISERROR(MODE(N101:P101)),MEDIAN(N101:P101),MODE(N101:P101)),\"\")","v":""},{"$f":"IF(D101<>\"\",VLOOKUP(D101,SIR_NUM,2,FALSE),\"\")","v":""},{"$f":"IF(F101<>\"\",VLOOKUP(F101,SIR_NUM,2,FALSE),\"\")","v":""},{"$f":"IF(H101<>\"\",VLOOKUP(H101,SIR_NUM,2,FALSE),\"\")","v":""}]
[]
[]
["Meropenem"]
["Isolate","Organism","Result 1",null,"Result 2",null,"Result 3",null,"Interpretation Mode or Median","Result 1","Result 2","Result 3","Mode","Result 1","Result 2","Result 3",null,null,"N","%","N Results Total"]
[null,null,"Intials, Date Tested","Interp","Intials, Date Tested","Interp","Intials, Date Tested","Interp",null,"Equivalency","Equivalency","Equivalency","Interp","Interp","Interp","Interp",null,"Category Equivalency",{"$f":"COUNTIF(J107:L111,\"Yes\")","v":0},{"$f":"IF(U106>0, S106/U106,\"\")","v":""},{"$f":"COUNTIF(J107:L111,\"Yes\")+COUNTIF(J107:L111,\"No\")","v":0}]
[null,null,null,null,null,null,null,null,{"$f":"IF(M107<>\"\",_xlfn.XLOOKUP(M107,number,Interp),\"\")","v":""},{"$f":"IF(AND($M107<>\"\",N107<>\"\"),IF(N107=$M107, \"Yes\",\"No\"),\"\")","v":""},{"$f":"IF(AND($M107<>\"\",O107<>\"\"),IF(O107=$M107, \"Yes\",\"No\"),\"\")","v":""},{"$f":"IF(AND($M107<>\"\",P107<>\"\"),IF(P107=$M107, \"Yes\",\"No\"),\"\")","v":""},{"$f":"IF(SUM(N107:P107)>0,IF(ISERROR(MODE(N107:P107)),MEDIAN(N107:P107),MODE(N107:P107)),\"\")","v":""},{"$f":"IF(D107<>\"\",VLOOKUP(D107,SIR_NUM,2,FALSE),\"\")","v":""},{"$f":"IF(F107<>\"\",VLOOKUP(F107,SIR_NUM,2,FALSE),\"\")","v":""},{"$f":"IF(H107<>\"\",VLOOKUP(H107,SIR_NUM,2,FALSE),\"\")","v":""}]
[null,null,null,null,null,null,null,null,{"$f":"IF(M108<>\"\",_xlfn.XLOOKUP(M108,number,Interp),\"\")","v":""},"","","",{"$f":"IF(SUM(N108:P108)>0,IF(ISERROR(MODE(N108:P108)),MEDIAN(N108:P108),MODE(N108:P108)),\"\")","v":""},{"$f":"IF(D108<>\"\",VLOOKUP(D108,SIR_NUM,2,FALSE),\"\")","v":""},{"$f":"IF(F108<>\"\",VLOOKUP(F108,SIR_NUM,2,FALSE),\"\")","v":""},{"$f":"IF(H108<>\"\",VLOOKUP(H108,SIR_NUM,2,FALSE),\"\")","v":""},null,0]
[null,null,null,null,null,null,null,null,{"$f":"IF(M109<>\"\",_xlfn.XLOOKUP(M109,number,Interp),\"\")","v":""},"","","",{"$f":"IF(SUM(N109:P109)>0,IF(ISERROR(MODE(N109:P109)),MEDIAN(N109:P109),MODE(N109:P109)),\"\")","v":""},{"$f":"IF(D109<>\"\",VLOOKUP(D109,SIR_NUM,2,FALSE),\"\")","v":""},{"$f":"IF(F109<>\"\",VLOOKUP(F109,SIR_NUM,2,FALSE),\"\")","v":""},{"$f":"IF(H109<>\"\",VLOOKUP(H109,SIR_NUM,2,FALSE),\"\")","v":""}]
[null,null,null,null,null,null,null,null,{"$f":"IF(M110<>\"\",_xlfn.XLOOKUP(M110,number,Interp),\"\")","v":""},"","","",{"$f":"IF(SUM(N110:P110)>0,IF(ISERROR(MODE(N110:P110)),MEDIAN(N110:P110),MODE(N110:P110)),\"\")","v":""},{"$f":"IF(D110<>\"\",VLOOKUP(D110,SIR_NUM,2,FALSE),\"\")","v":""},{"$f":"IF(F110<>\"\",VLOOKUP(F110,SIR_NUM,2,FALSE),\"\")","v":""},{"$f":"IF(H110<>\"\",VLOOKUP(H110,SIR_NUM,2,FALSE),\"\")","v":""}]
[null,null,null,null,null,null,null,null,{"$f":"IF(M111<>\"\",_xlfn.XLOOKUP(M111,number,Interp),\"\")","v":""},"","",{"$f":"IF(AND($M111<>\"\",P111<>\"\"),IF(P111=$M111, \"Yes\",\"No\"),\"\")","v":""},{"$f":"IF(SUM(N111:P111)>0,IF(ISERROR(MODE(N111:P111)),MEDIAN(N111:P111),MODE(N111:P111)),\"\")","v":""},{"$f":"IF(D111<>\"\",VLOOKUP(D111,SIR_NUM,2,FALSE),\"\")","v":""},{"$f":"IF(F111<>\"\",VLOOKUP(F111,SIR_NUM,2,FALSE),\"\")","v":""},{"$f":"IF(H111<>\"\",VLOOKUP(H111,SIR_NUM,2,FALSE),\"\")","v":""}]

{"sheet":"BIT-2","index":5,"n_rows":48,"n_cols":79,"rows_kept":48,"cut":false,"hidden":false,"merged":[[0,64,0,78],[4,64,4,67],[4,69,4,73],[4,74,4,78],[41,69,41,72],[40,64,40,78],[0,34,0,48],[4,29,4,33],[4,14,4,18],[4,9,4,13],[4,2,4,3],[4,4,4,7],[4,19,4,22],[4,24,4,28],[41,54,41,57],[41,39,41,42],[4,0,4,1],[1,0,3,3],[0,0,0,3],[41,24,41,27],[41,9,41,12],[0,49,0,63],[4,49,4,52],[4,54,4,58],[4,59,4,63],[4,34,4,37],[4,39,4,43],[4,44,4,48],[0,4,0,18],[0,19,0,33]]}
["AR Bank PTA Validation Set",null,null,null,"Piperacillin/Tazobactam Breakpoints 8(S)/16(SDD)/32(R)",null,null,null,null,null,null,null,null,null,null,null,null,null,null,"Gentamicin Breakpoints 2(S)/4(I)/8(R)",null,null,null,null,null,null,null,null,null,null,null,null,null,null,"Tobramycin Breakpoints 2(S)/4(I)/8(R)",null,null,null,null,null,null,null,null,null,null,null,null,null,null,"Amikacin Breakpoints 4(S)/8(I)/16(R)",null,null,null,null,null,null,null,null,null,null,null,null,null,null,"Colistin Breakpoints 2(I)/4(R)"]
["This set can be used to validate Enterobacterales and piperacillin/tazobactam and aminoglycosides",null,null,null,"N 'S'",{"$f":"COUNTIF(H$7:H$40,\"S\")","v":14},null,null,null,null,null,null,null,null,null,null,null,null,null,"N 'S'",{"$f":"COUNTIF(W$7:W$40,\"S\")","v":16},null,null,null,null,null,null,null,null,null,null,null,null,null,"N 'S'",{"$f":"COUNTIF(AL$7:AL$40,\"S\")","v":13},null,null,null,null,null,null,null,null,null,null,null,null,null,"N 'S'",{"$f":"COUNTIF(BA$7:BA$40,\"S\")","v":20},null,null,null,null,null,null,null,null,null,null,null,null,null,"N 'S'",{"$f":"COUNTIF(BP$7:BP$40,\"S\")","v":0}]
[null,null,null,null,"N 'SDD'",{"$f":"COUNTIF(H$7:H$40,\"SDD\")","v":1},null,null,null,null,null,null,null,null,null,null,null,null,null,"N 'I'",{"$f":"COUNTIF(W$7:W$40,\"I\")","v":2},null,null,null,null,null,null,null,null,null,null,null,null,null,"N 'I'",{"$f":"COUNTIF(AL$7:AL$40,\"I\")","v":3},null,null,null,null,null,null,null,null,null,null,null,null,null,"N 'I'",{"$f":"COUNTIF(BA$7:BA$40,\"I\")","v":1},null,null,null,null,null,null,null,null,null,null,null,null,null,"N 'I'",{"$f":"COUNTIF(BP$7:BP$40,\"I\")","v":29}]
[null,null,null,null,"N 'R'",{"$f":"COUNTIF(H$7:H$40,\"R\")","v":19},null,null,null,null,null,null,null,null,null,null,null,null,null,"N 'R'",{"$f":"COUNTIF(W$7:W$40,\"R\")","v":16},null,null,null,null,null,null,null,null,null,null,null,null,null,"N 'R'",{"$f":"COUNTIF(AL$7:AL$40,\"R\")","v":18},null,null,null,null,null,null,null,null,null,null,null,null,null,"N 'R'",{"$f":"COUNTIF(BA$7:BA$40,\"R\")","v":13},null,null,null,null,null,null,null,null,null,null,null,null,null,"N 'R'",{"$f":"COUNTIF(BP$7:BP$40,\"R\")","v":2}]
["Lab Information",null,"AR Bank Information",null,"Pip/Tazo AR Bank Data",null,null,null,null,"Pip/Tazo Test Data ",null,null,null,null,"Pip/Tazo Calculations",null,null,null,null,"Gentamicin AR Bank Data",null,null,null,null," Gentamicin Test Data ",null,null,null,null," Gentamicin Calculations",null,null,null,null,"Tobramycin AR Bank Data",null,null,null,null," Tobramycin Test Data ",null,null,null,null,"Tobramycin Calculations",null,null,null,null,"Amikacin AR Bank Data",null,null,null,null,"Amikacin Test Data ",null,null,null,null,"Amikacin Calculations",null,null,null,null,"Colistin AR Bank Data",null,null,null,null,"Colistin Test Data ",null,null,null,null,"Colistin Calculations"]
["Date Tested","Initials of Tester","AR Bank Number","Organism","Sign","MIC","Hidden MIC Result (conservative)","Interp","Hidden MIC Result Logged","Test Sign","Test  MIC","Hidden MIC Result (conservative)","Test Interp","Hidden MIC Result Logged","EA","Hidden Eval","Dilutions","CA","Error","Sign","MIC","Hidden MIC Result (conservative)","Interp","Hidden MIC Result Logged","Test Sign","Test  MIC","Hidden MIC Result (conservative)","Test Interp","Hidden MIC Result Logged","EA","Hidden Eval","Dilutions","CA","Error","Sign","MIC","Hidden MIC Result (conservative)","Interp","Hidden MIC Result Logged","Test Sign","Test  MIC","Hidden MIC Result (conservative)","Test Interp","Hidden MIC Result Logged","EA","Hidden Eval","Dilutions","CA","Error","Sign","MIC","Hidden MIC Result (conservative)","Interp","Hidden MIC Result Logged","Test Sign","Test  MIC","Hidden MIC Result (conservative)","Test Interp","Hidden MIC Result Logged","EA","Hidden Eval","Dilutions","CA","Error","Sign","MIC","Hidden MIC Result (conservative)","Interp","Hidden MIC Result Logged","Test Sign","Test  MIC","Hidden MIC Result (conservative)","Test Interp","Hidden MIC Result Logged","EA","Hidden Eval","Dilutions","CA","Error"]
[null,null,"AR0001","Escherichia coli",">",128,{"$f":"IF(AND(F7<>\"\"),IF(E7=\">\",F7*2,F7*1),\"\")","v":256},{"$f":"IF((ISNUMBER(G7)),\nIF(G7<=8,\"S\",\nIF(G7=16,\"SDD\",\nIF(G7>=32,\"R\", \"\"))),\"\")","v":"R"},{"$f":"IF(ISNUMBER(G7),ROUND(IMLOG2(G7),1),\"\")","v":8},null,null,{"$f":"IF(AND(ISNUMBER(K7)),IF(J7=\">\",K7*2,K7),\"\")","v":""},{"$f":"IF((ISNUMBER(L7)),\nIF(L7<=8,\"S\",\nIF(L7=16,\"SDD\",\nIF(L7>=32,\"R\", \"\"))),\"\")","v":""},{"$f":"IF(ISNUMBER(L7),ROUND(IMLOG2(L7),1),\"\")","v":""},{"$f":"IF(ISNUMBER(L7),IF(AND(E7=\">\",L7>=G7),\"YES\",IF(AND(OR(J7=\">\",J7=\">=\"),G7>L7),\"YES\",IF(AND(E7=\"<=\",L7<G7),\"YES\",IF(AND(J7=\"<=\",G7<L7),\"YES\",IF(ABS(N7-I7)<=1,\"YES\",\"NO\"))))),\"\")","v":""},{"$f":"IF(ISNUMBER(K7),IF(AND(E7=\"<=\",N7<=I7), \"No\", IF(AND(E7=\"<=\", J7=\"<=\"), \"No\", IF(AND(E7=\">\",N7>=I7), \"No\", IF(AND(J7=\"<=\", I7<=N7), \"No\", IF(AND(OR(J7=\">\",J7=\">=\"),I7>=N7), \"No\", \"yes\"))))),\"\")","v":""},{"$f":"IF(ISNUMBER(K7),IF(AND(J7=\"<=\",E7=\"<=\"),0,IF(AND(OR(J7=\">\",J7=\">=\"),E7=\">\"),0,IF(AND(J7=\"<=\",I7<N7),0, IF(AND(E7=\"<=\", N7<I7),0,IF(AND(OR(E7=\">\", E7=\">=\"),N7>I7),0,IF(AND(OR(J7=\">\", J7=\">=\"),I7>N7),0,IF(ISNUMBER(K7),N7-I7,\"\"))))))),\"\")","v":""},{"$f":"IF(M7<>\"\",IF(EXACT(M7,H7),\"YES\",\"NO\"),\"\")","v":""},{"$f":"IF(M7<>\"\", IF(AND(H7=\"SDD\",OR(M7=\"S\",M7=\"R\")),\"minE\",IF(AND(M7=\"SDD\",OR(H7=\"S\",H7=\"R\")),\"minE\",IF(AND(H7=\"R\",M7=\"S\"),\"VME\",IF(AND(H7=\"S\",M7=\"R\"),\"ME\",\"\")))),\"\")","v":""},null,4,{"$f":"IF(AND(U7<>\"\"),IF(T7=\">\",U7*2,U7*1),\"\")","v":4},{"$f":"IF((ISNUMBER(V7)),\nIF(V7<=2,\"S\",\nIF(V7=4,\"I\",\nIF(V7>=8,\"R\", \"\"))),\"\")","v":"I"},{"$f":"IF(ISNUMBER(V7),ROUND(IMLOG2(V7),1),\"\")","v":2},null,null,{"$f":"IF(AND(ISNUMBER(Z7)),IF(Y7=\">\",Z7*2,Z7),\"\")","v":""},{"$f":"IF((ISNUMBER(AA7)),\nIF(AA7<=2,\"S\",\nIF(AA7=4,\"I\",\nIF(AA7>=8,\"R\", \"\"))),\"\")","v":""},{"$f":"IF(ISNUMBER(AA7),ROUND(IMLOG2(AA7),1),\"\")","v":""},{"$f":"IF(ISNUMBER(AA7),IF(AND(T7=\">\",AA7>=V7),\"YES\",IF(AND(OR(Y7=\">\",Y7=\">=\"),V7>AA7),\"YES\",IF(AND(T7=\"<=\",AA7<V7),\"YES\",IF(AND(Y7=\"<=\",V7<AA7),\"YES\",IF(ABS(AC7-X7)<=1,\"YES\",\"NO\"))))),\"\")","v":""},{"$f":"IF(ISNUMBER(Z7),IF(AND(T7=\"<=\",AC7<=X7), \"No\", IF(AND(T7=\"<=\", Y7=\"<=\"), \"No\", IF(AND(T7=\">\",AC7>=X7), \"No\", IF(AND(Y7=\"<=\", X7<=AC7), \"No\", IF(AND(OR(Y7=\">\",Y7=\">=\"),X7>=AC7), \"No\", \"yes\"))))),\"\")","v":""},{"$f":"IF(ISNUMBER(Z7),IF(AND(Y7=\"<=\",T7=\"<=\"),0,IF(AND(OR(Y7=\">\",Y7=\">=\"),T7=\">\"),0,IF(AND(Y7=\"<=\",X7<AC7),0, IF(AND(T7=\"<=\", AC7<X7),0,IF(AND(OR(T7=\">\", T7=\">=\"),AC7>X7),0,IF(AND(OR(Y7=\">\", Y7=\">=\"),X7>AC7),0,IF(ISNUMBER(Z7),AC7-X7,\"\"))))))),\"\")","v":""},{"$f":"IF(AB7<>\"\",IF(EXACT(AB7,W7),\"YES\",\"NO\"),\"\")","v":""},{"$f":"IF(AB7<>\"\", IF(AND(W7=\"I\",OR(AB7=\"S\",AB7=\"R\")),\"minE\",IF(AND(AB7=\"I\",OR(W7=\"S\",W7=\"R\")),\"minE\",IF(AND(W7=\"R\",AB7=\"S\"),\"VME\",IF(AND(W7=\"S\",AB7=\"R\"),\"ME\",\"\")))),\"\")","v":""},">",16,{"$f":"IF(AND(AJ7<>\"\"),IF(AI7=\">\",AJ7*2,AJ7*1),\"\")","v":32},{"$f":"IF((ISNUMBER(AK7)),\nIF(AK7<=2,\"S\",\nIF(AK7=4,\"I\",\nIF(AK7>=8,\"R\", \"\"))),\"\")","v":"R"},{"$f":"IF(ISNUMBER(AK7),ROUND(IMLOG2(AK7),1),\"\")","v":5},null,null,{"$f":"IF(AND(ISNUMBER(AO7)),IF(AN7=\">\",AO7*2,AO7),\"\")","v":""},{"$f":"IF((ISNUMBER(AP7)),\nIF(AP7<=2,\"S\",\nIF(AP7=4,\"I\",\nIF(AP7>=8,\"R\", \"\"))),\"\")","v":""},{"$f":"IF(ISNUMBER(AP7),ROUND(IMLOG2(AP7),1),\"\")","v":""},{"$f":"IF(ISNUMBER(AP7),IF(AND(AI7=\">\",AP7>=AK7),\"YES\",IF(AND(OR(AN7=\">\",AN7=\">=\"),AK7>AP7),\"YES\",IF(AND(AI7=\"<=\",AP7<AK7),\"YES\",IF(AND(AN7=\"<=\",AK7<AP7),\"YES\",IF(ABS(AR7-AM7)<=1,\"YES\",\"NO\"))))),\"\")","v":""},{"$f":"IF(ISNUMBER(AO7),IF(AND(AI7=\"<=\",AR7<=AM7), \"No\", IF(AND(AI7=\"<=\", AN7=\"<=\"), \"No\", IF(AND(AI7=\">\",AR7>=AM7), \"No\", IF(AND(AN7=\"<=\", AM7<=AR7), \"No\", IF(AND(OR(AN7=\">\",AN7=\">=\"),AM7>=AR7), \"No\", \"yes\"))))),\"\")","v":""},{"$f":"IF(ISNUMBER(AO7),IF(AND(AN7=\"<=\",AI7=\"<=\"),0,IF(AND(OR(AN7=\">\",AN7=\">=\"),AI7=\">\"),0,IF(AND(AN7=\"<=\",AM7<AR7),0, IF(AND(AI7=\"<=\", AR7<AM7),0,IF(AND(OR(AI7=\">\", AI7=\">=\"),AR7>AM7),0,IF(AND(OR(AN7=\">\", AN7=\">=\"),AM7>AR7),0,IF(ISNUMBER(AO7),AR7-AM7,\"\"))))))),\"\")","v":""},{"$f":"IF(AQ7<>\"\",IF(EXACT(AQ7,AL7),\"YES\",\"NO\"),\"\")","v":""},{"$f":"IF(AQ7<>\"\", IF(AND(AL7=\"I\",OR(AQ7=\"S\",AQ7=\"R\")),\"minE\",IF(AND(AQ7=\"I\",OR(AL7=\"S\",AL7=\"R\")),\"minE\",IF(AND(AL7=\"R\",AQ7=\"S\"),\"VME\",IF(AND(AL7=\"S\",AQ7=\"R\"),\"ME\",\"\")))),\"\")","v":""},null,16,{"$f":"IF(AND(AY7<>\"\"),IF(AX7=\">\",AY7*2,AY7*1),\"\")","v":16},{"$f":"IF((ISNUMBER(AZ7)),\nIF(AZ7<=4,\"S\",\nIF(AZ7=8,\"I\",\nIF(AZ7>=16,\"R\", \"\"))),\"\")","v":"R"},{"$f":"IF(ISNUMBER(AZ7),ROUND(IMLOG2(AZ7),1),\"\")","v":4},null,null,{"$f":"IF(AND(ISNUMBER(BD7)),IF(BC7=\">\",BD7*2,BD7),\"\")","v":""},{"$f":"IF((ISNUMBER(BE7)),\nIF(BE7<=4,\"S\",\nIF(BE7=8,\"I\",\nIF(BE7>=16,\"R\", \"\"))),\"\")","v":""},{"$f":"IF(ISNUMBER(BE7),ROUND(IMLOG2(BE7),1),\"\")","v":""},{"$f":"IF(ISNUMBER(BE7),IF(AND(AX7=\">\",BE7>=AZ7),\"YES\",IF(AND(OR(BC7=\">\",BC7=\">=\"),AZ7>BE7),\"YES\",IF(AND(AX7=\"<=\",BE7<AZ7),\"YES\",IF(AND(BC7=\"<=\",AZ7<BE7),\"YES\",IF(ABS(BG7-BB7)<=1,\"YES\",\"NO\"))))),\"\")","v":""},{"$f":"IF(ISNUMBER(BD7),IF(AND(AX7=\"<=\",BG7<=BB7), \"No\", IF(AND(AX7=\"<=\", BC7=\"<=\"), \"No\", IF(AND(AX7=\">\",BG7>=BB7), \"No\", IF(AND(BC7=\"<=\", BB7<=BG7), \"No\", IF(AND(OR(BC7=\">\",BC7=\">=\"),BB7>=BG7), \"No\", \"yes\"))))),\"\")","v":""},{"$f":"IF(ISNUMBER(BD7),IF(AND(BC7=\"<=\",AX7=\"<=\"),0,IF(AND(OR(BC7=\">\",BC7=\">=\"),AX7=\">\"),0,IF(AND(BC7=\"<=\",BB7<BG7),0, IF(AND(AX7=\"<=\", BG7<BB7),0,IF(AND(OR(AX7=\">\", AX7=\">=\"),BG7>BB7),0,IF(AND(OR(BC7=\">\", BC7=\">=\"),BB7>BG7),0,IF(ISNUMBER(BD7),BG7-BB7,\"\"))))))),\"\")","v":""},{"$f":"IF(BF7<>\"\",IF(EXACT(BF7,BA7),\"YES\",\"NO\"),\"\")","v":""},{"$f":"IF(BF7<>\"\", IF(AND(BA7=\"I\",OR(BF7=\"S\",BF7=\"R\")),\"minE\",IF(AND(BF7=\"I\",OR(BA7=\"S\",BA7=\"R\")),\"minE\",IF(AND(BA7=\"R\",BF7=\"S\"),\"VME\",IF(AND(BA7=\"S\",BF7=\"R\"),\"ME\",\"\")))),\"\")","v":""},null,0.5,{"$f":"IF(AND(BN7<>\"\"),IF(BM7=\">\",BN7*2,BN7*1),\"\")","v":0.5},{"$f":"IF((ISNUMBER(BO7)),\nIF(BO7<=2,\"I\",\nIF(BO7>=4,\"R\", \"\")),\"\")","v":"I"},{"$f":"IF(ISNUMBER(BO7),ROUND(IMLOG2(BO7),1),\"\")","v":-1},null,null,{"$f":"IF(AND(ISNUMBER(BS7)),IF(BR7=\">\",BS7*2,BS7),\"\")","v":""},{"$f":"IF((ISNUMBER(BT7)),\nIF(BT7<=2,\"I\",\nIF(BT7>=4,\"R\", \"\")),\"\")","v":""},{"$f":"IF(ISNUMBER(BT7),ROUND(IMLOG2(BT7),1),\"\")","v":""},{"$f":"IF(ISNUMBER(BT7),IF(AND(BM7=\">\",BT7>=BO7),\"YES\",IF(AND(OR(BR7=\">\",BR7=\">=\"),BO7>BT7),\"YES\",IF(AND(BM7=\"<=\",BT7<BO7),\"YES\",IF(AND(BR7=\"<=\",BO7<BT7),\"YES\",IF(ABS(BV7-BQ7)<=1,\"YES\",\"NO\"))))),\"\")","v":""},{"$f":"IF(ISNUMBER(BS7),IF(AND(BM7=\"<=\",BV7<=BQ7), \"No\", IF(AND(BM7=\"<=\", BR7=\"<=\"), \"No\", IF(AND(BM7=\">\",BV7>=BQ7), \"No\", IF(AND(BR7=\"<=\", BQ7<=BV7), \"No\", IF(AND(OR(BR7=\">\",BR7=\">=\"),BQ7>=BV7), \"No\", \"yes\"))))),\"\")","v":""},{"$f":"IF(ISNUMBER(BS7),IF(AND(BR7=\"<=\",BM7=\"<=\"),0,IF(AND(OR(BR7=\">\",BR7=\">=\"),BM7=\">\"),0,IF(AND(BR7=\"<=\",BQ7<BV7),0, IF(AND(BM7=\"<=\", BV7<BQ7),0,IF(AND(OR(BM7=\">\", BM7=\">=\"),BV7>BQ7),0,IF(AND(OR(BR7=\">\", BR7=\">=\"),BQ7>BV7),0,IF(ISNUMBER(BS7),BV7-BQ7,\"\"))))))),\"\")","v":""},{"$f":"IF(BU7<>\"\",IF(EXACT(BU7,BP7),\"YES\",\"NO\"),\"\")","v":""},{"$f":"IF(BU7<>\"\", IF(AND(BP7=\"I\",OR(BU7=\"S\",BU7=\"R\")),\"minE\",IF(AND(BU7=\"I\",OR(BP7=\"S\",BP7=\"R\")),\"minE\",IF(AND(BP7=\"R\",BU7=\"S\"),\"VME\",IF(AND(BP7=\"S\",BU7=\"R\"),\"ME\",\"\")))),\"\")","v":""}]
[null,null,"AR0002","Enterobacter cloacae",">",128,256,{"$f":"IF((ISNUMBER(G8)),\nIF(G8<=8,\"S\",\nIF(G8=16,\"SDD\",\nIF(G8>=32,\"R\", \"\"))),\"\")","v":"R"},8,null,null,{"$f":"IF(AND(ISNUMBER(K8)),IF(J8=\">\",K8*2,K8),\"\")","v":""},{"$f":"IF((ISNUMBER(L8)),\nIF(L8<=8,\"S\",\nIF(L8=16,\"SDD\",\nIF(L8>=32,\"R\", \"\"))),\"\")","v":""},{"$f":"IF(ISNUMBER(L8),ROUND(IMLOG2(L8),1),\"\")","v":""},{"$f":"IF(ISNUMBER(L8),IF(AND(E8=\">\",L8>=G8),\"YES\",IF(AND(OR(J8=\">\",J8=\">=\"),G8>L8),\"YES\",IF(AND(E8=\"<=\",L8<G8),\"YES\",IF(AND(J8=\"<=\",G8<L8),\"YES\",IF(ABS(N8-I8)<=1,\"YES\",\"NO\"))))),\"\")","v":""},{"$f":"IF(ISNUMBER(K8),IF(AND(E8=\"<=\",N8<=I8), \"No\", IF(AND(E8=\"<=\", J8=\"<=\"), \"No\", IF(AND(E8=\">\",N8>=I8), \"No\", IF(AND(J8=\"<=\", I8<=N8), \"No\", IF(AND(OR(J8=\">\",J8=\">=\"),I8>=N8), \"No\", \"yes\"))))),\"\")","v":""},{"$f":"IF(ISNUMBER(K8),IF(AND(J8=\"<=\",E8=\"<=\"),0,IF(AND(OR(J8=\">\",J8=\">=\"),E8=\">\"),0,IF(AND(J8=\"<=\",I8<N8),0, IF(AND(E8=\"<=\", N8<I8),0,IF(AND(OR(E8=\">\", E8=\">=\"),N8>I8),0,IF(AND(OR(J8=\">\", J8=\">=\"),I8>N8),0,IF(ISNUMBER(K8),N8-I8,\"\"))))))),\"\")","v":""},{"$f":"IF(M8<>\"\",IF(EXACT(M8,H8),\"YES\",\"NO\"),\"\")","v":""},{"$f":"IF(M8<>\"\", IF(AND(H8=\"SDD\",OR(M8=\"S\",M8=\"R\")),\"minE\",IF(AND(M8=\"SDD\",OR(H8=\"S\",H8=\"R\")),\"minE\",IF(AND(H8=\"R\",M8=\"S\"),\"VME\",IF(AND(H8=\"S\",M8=\"R\"),\"ME\",\"\")))),\"\")","v":""},null,8,8,{"$f":"IF((ISNUMBER(V8)),\nIF(V8<=2,\"S\",\nIF(V8=4,\"I\",\nIF(V8>=8,\"R\", \"\"))),\"\")","v":"R"},3,null,null,{"$f":"IF(AND(ISNUMBER(Z8)),IF(Y8=\">\",Z8*2,Z8),\"\")","v":""},{"$f":"IF((ISNUMBER(AA8)),\nIF(AA8<=2,\"S\",\nIF(AA8=4,\"I\",\nIF(AA8>=8,\"R\", \"\"))),\"\")","v":""},{"$f":"IF(ISNUMBER(AA8),ROUND(IMLOG2(AA8),1),\"\")","v":""},{"$f":"IF(ISNUMBER(AA8),IF(AND(T8=\">\",AA8>=V8),\"YES\",IF(AND(OR(Y8=\">\",Y8=\">=\"),V8>AA8),\"YES\",IF(AND(T8=\"<=\",AA8<V8),\"YES\",IF(AND(Y8=\"<=\",V8<AA8),\"YES\",IF(ABS(AC8-X8)<=1,\"YES\",\"NO\"))))),\"\")","v":""},{"$f":"IF(ISNUMBER(Z8),IF(AND(T8=\"<=\",AC8<=X8), \"No\", IF(AND(T8=\"<=\", Y8=\"<=\"), \"No\", IF(AND(T8=\">\",AC8>=X8), \"No\", IF(AND(Y8=\"<=\", X8<=AC8), \"No\", IF(AND(OR(Y8=\">\",Y8=\">=\"),X8>=AC8), \"No\", \"yes\"))))),\"\")","v":""},{"$f":"IF(ISNUMBER(Z8),IF(AND(Y8=\"<=\",T8=\"<=\"),0,IF(AND(OR(Y8=\">\",Y8=\">=\"),T8=\">\"),0,IF(AND(Y8=\"<=\",X8<AC8),0, IF(AND(T8=\"<=\", AC8<X8),0,IF(AND(OR(T8=\">\", T8=\">=\"),AC8>X8),0,IF(AND(OR(Y8=\">\", Y8=\">=\"),X8>AC8),0,IF(ISNUMBER(Z8),AC8-X8,\"\"))))))),\"\")","v":""},{"$f":"IF(AB8<>\"\",IF(EXACT(AB8,W8),\"YES\",\"NO\"),\"\")","v":""},{"$f":"IF(AB8<>\"\", IF(AND(W8=\"I\",OR(AB8=\"S\",AB8=\"R\")),\"minE\",IF(AND(AB8=\"I\",OR(W8=\"S\",W8=\"R\")),\"minE\",IF(AND(W8=\"R\",AB8=\"S\"),\"VME\",IF(AND(W8=\"S\",AB8=\"R\"),\"ME\",\"\")))),\"\")","v":""},null,16,16,"R",4,null,null,{"$f":"IF(AND(ISNUMBER(AO8)),IF(AN8=\">\",AO8*2,AO8),\"\")","v":""},{"$f":"IF((ISNUMBER(AP8)),\nIF(AP8<=2,\"S\",\nIF(AP8=4,\"I\",\nIF(AP8>=8,\"R\", \"\"))),\"\")","v":""},{"$f":"IF(ISNUMBER(AP8),ROUND(IMLOG2(AP8),1),\"\")","v":""},{"$f":"IF(ISNUMBER(AP8),IF(AND(AI8=\">\",AP8>=AK8),\"YES\",IF(AND(OR(AN8=\">\",AN8=\">=\"),AK8>AP8),\"YES\",IF(AND(AI8=\"<=\",AP8<AK8),\"YES\",IF(AND(AN8=\"<=\",AK8<AP8),\"YES\",IF(ABS(AR8-AM8)<=1,\"YES\",\"NO\"))))),\"\")","v":""},{"$f":"IF(ISNUMBER(AO8),IF(AND(AI8=\"<=\",AR8<=AM8), \"No\", IF(AND(AI8=\"<=\", AN8=\"<=\"), \"No\", IF(AND(AI8=\">\",AR8>=AM8), \"No\", IF(AND(AN8=\"<=\", AM8<=AR8), \"No\", IF(AND(OR(AN8=\">\",AN8=\">=\"),AM8>=AR8), \"No\", \"yes\"))))),\"\")","v":""},{"$f":"IF(ISNUMBER(AO8),IF(AND(AN8=\"<=\",AI8=\"<=\"),0,IF(AND(OR(AN8=\">\",AN8=\">=\"),AI8=\">\"),0,IF(AND(AN8=\"<=\",AM8<AR8),0, IF(AND(AI8=\"<=\", AR8<AM8),0,IF(AND(OR(AI8=\">\", AI8=\">=\"),AR8>AM8),0,IF(AND(OR(AN8=\">\", AN8=\">=\"),AM8>AR8),0,IF(ISNUMBER(AO8),AR8-AM8,\"\"))))))),\"\")","v":""},{"$f":"IF(AQ8<>\"\",IF(EXACT(AQ8,AL8),\"YES\",\"NO\"),\"\")","v":""},{"$f":"IF(AQ8<>\"\", IF(AND(AL8=\"I\",OR(AQ8=\"S\",AQ8=\"R\")),\"minE\",IF(AND(AQ8=\"I\",OR(AL8=\"S\",AL8=\"R\")),\"minE\",IF(AND(AL8=\"R\",AQ8=\"S\"),\"VME\",IF(AND(AL8=\"S\",AQ8=\"R\"),\"ME\",\"\")))),\"\")","v":""},null,2,2,{"$f":"IF((ISNUMBER(AZ8)),\nIF(AZ8<=4,\"S\",\nIF(AZ8=8,\"I\",\nIF(AZ8>=16,\"R\", \"\"))),\"\")","v":"S"},1,null,null,{"$f":"IF(AND(ISNUMBER(BD8)),IF(BC8=\">\",BD8*2,BD8),\"\")","v":""},{"$f":"IF((ISNUMBER(BE8)),\nIF(BE8<=4,\"S\",\nIF(BE8=8,\"I\",\nIF(BE8>=16,\"R\", \"\"))),\"\")","v":""},{"$f":"IF(ISNUMBER(BE8),ROUND(IMLOG2(BE8),1),\"\")","v":""},{"$f":"IF(ISNUMBER(BE8),IF(AND(AX8=\">\",BE8>=AZ8),\"YES\",IF(AND(OR(BC8=\">\",BC8=\">=\"),AZ8>BE8),\"YES\",IF(AND(AX8=\"<=\",BE8<AZ8),\"YES\",IF(AND(BC8=\"<=\",AZ8<BE8),\"YES\",IF(ABS(BG8-BB8)<=1,\"YES\",\"NO\"))))),\"\")","v":""},{"$f":"IF(ISNUMBER(BD8),IF(AND(AX8=\"<=\",BG8<=BB8), \"No\", IF(AND(AX8=\"<=\", BC8=\"<=\"), \"No\", IF(AND(AX8=\">\",BG8>=BB8), \"No\", IF(AND(BC8=\"<=\", BB8<=BG8), \"No\", IF(AND(OR(BC8=\">\",BC8=\">=\"),BB8>=BG8), \"No\", \"yes\"))))),\"\")","v":""},{"$f":"IF(ISNUMBER(BD8),IF(AND(BC8=\"<=\",AX8=\"<=\"),0,IF(AND(OR(BC8=\">\",BC8=\">=\"),AX8=\">\"),0,IF(AND(BC8=\"<=\",BB8<BG8),0, IF(AND(AX8=\"<=\", BG8<BB8),0,IF(AND(OR(AX8=\">\", AX8=\">=\"),BG8>BB8),0,IF(AND(OR(BC8=\">\", BC8=\">=\"),BB8>BG8),0,IF(ISNUMBER(BD8),BG8-BB8,\"\"))))))),\"\")","v":""},{"$f":"IF(BF8<>\"\",IF(EXACT(BF8,BA8),\"YES\",\"NO\"),\"\")","v":""},{"$f":"IF(BF8<>\"\", IF(AND(BA8=\"I\",OR(BF8=\"S\",BF8=\"R\")),\"minE\",IF(AND(BF8=\"I\",OR(BA8=\"S\",BA8=\"R\")),\"minE\",IF(AND(BA8=\"R\",BF8=\"S\"),\"VME\",IF(AND(BA8=\"S\",BF8=\"R\"),\"ME\",\"\")))),\"\")","v":""},null,0.5,0.5,{"$f":"IF((ISNUMBER(BO8)),\nIF(BO8<=2,\"I\",\nIF(BO8>=4,\"R\", \"\")),\"\")","v":"I"},-1,null,null,{"$f":"IF(AND(ISNUMBER(BS8)),IF(BR8=\">\",BS8*2,BS8),\"\")","v":""},{"$f":"IF((ISNUMBER(BT8)),\nIF(BT8<=2,\"I\",\nIF(BT8>=4,\"R\", \"\")),\"\")","v":""},"",{"$f":"IF(ISNUMBER(BT8),IF(AND(BM8=\">\",BT8>=BO8),\"YES\",IF(AND(OR(BR8=\">\",BR8=\">=\"),BO8>BT8),\"YES\",IF(AND(BM8=\"<=\",BT8<BO8),\"YES\",IF(AND(BR8=\"<=\",BO8<BT8),\"YES\",IF(ABS(BV8-BQ8)<=1,\"YES\",\"NO\"))))),\"\")","v":""},"","","",""]
[null,null,"AR0003","Klebsiella pneumoniae",">",128,256,"R",8,null,null,"","","","","","","","",null,4,4,"I",2,null,null,"","","","","","","","",null,16,16,"R",4,null,null,"","","","","","","","",null,2,2,"S",1,null,null,"","","","","","","","",null,0.5,0.5,"I",-1,null,null,"","","","","","","",""]
[null,null,"AR0004","Klebsiella pneumoniae",">",128,256,"R",8,null,null,"","","","","","","","",null,1,1,"S",0,null,null,"","","","","","","","",null,16,16,"R",4,null,null,"","","","","","","","",null,16,16,"R",4,null,null,"","","","","","","","",null,0.5,0.5,"I",-1,null,null,"","","","","","","",""]
[null,null,"AR0006","Escherichia coli",">",128,256,"R",8,null,null,"","","","","","","","",">",16,32,"R",5,null,null,"","","","","","","","",">",16,32,"R",5,null,null,"","","","","","","","",null,16,16,"R",4,null,null,"","","","","","","","",null,0.5,0.5,"I",-1,null,null,"","","","","","","",""]
[null,null,"AR0009","Klebsiella aerogenes",null,64,64,"R",6,null,null,"","","","","","","","",null,0.5,0.5,"S",-1,null,null,"","","","","","","","",null,1,{"$f":"IF(AND(AJ12<>\"\"),IF(AI12=\">\",AJ12*2,AJ12*1),\"\")","v":1},"S",{"$f":"IF(ISNUMBER(AK12),ROUND(IMLOG2(AK12),1),\"\")","v":0},null,null,{"$f":"IF(AND(ISNUMBER(AO12)),IF(AN12=\">\",AO12*2,AO12),\"\")","v":""},"",{"$f":"IF(ISNUMBER(AP12),ROUND(IMLOG2(AP12),1),\"\")","v":""},{"$f":"IF(ISNUMBER(AP12),IF(AND(AI12=\">\",AP12>=AK12),\"YES\",IF(AND(OR(AN12=\">\",AN12=\">=\"),AK12>AP12),\"YES\",IF(AND(AI12=\"<=\",AP12<AK12),\"YES\",IF(AND(AN12=\"<=\",AK12<AP12),\"YES\",IF(ABS(AR12-AM12)<=1,\"YES\",\"NO\"))))),\"\")","v":""},{"$f":"IF(ISNUMBER(AO12),IF(AND(AI12=\"<=\",AR12<=AM12), \"No\", IF(AND(AI12=\"<=\", AN12=\"<=\"), \"No\", IF(AND(AI12=\">\",AR12>=AM12), \"No\", IF(AND(AN12=\"<=\", AM12<=AR12), \"No\", IF(AND(OR(AN12=\">\",AN12=\">=\"),AM12>=AR12), \"No\", \"yes\"))))),\"\")","v":""},{"$f":"IF(ISNUMBER(AO12),IF(AND(AN12=\"<=\",AI12=\"<=\"),0,IF(AND(OR(AN12=\">\",AN12=\">=\"),AI12=\">\"),0,IF(AND(AN12=\"<=\",AM12<AR12),0, IF(AND(AI12=\"<=\", AR12<AM12),0,IF(AND(OR(AI12=\">\", AI12=\">=\"),AR12>AM12),0,IF(AND(OR(AN12=\">\", AN12=\">=\"),AM12>AR12),0,IF(ISNUMBER(AO12),AR12-AM12,\"\"))))))),\"\")","v":""},{"$f":"IF(AQ12<>\"\",IF(EXACT(AQ12,AL12),\"YES\",\"NO\"),\"\")","v":""},{"$f":"IF(AQ12<>\"\", IF(AND(AL12=\"I\",OR(AQ12=\"S\",AQ12=\"R\")),\"minE\",IF(AND(AQ12=\"I\",OR(AL12=\"S\",AL12=\"R\")),\"minE\",IF(AND(AL12=\"R\",AQ12=\"S\"),\"VME\",IF(AND(AL12=\"S\",AQ12=\"R\"),\"ME\",\"\")))),\"\")","v":""},null,2,2,"S",1,null,null,"","","","","","","","",null,0.5,0.5,"I",-1,null,null,"","","","","","","",""]
[null,null,"AR0010","Klebsiella pneumoniae",null,64,64,"R",6,null,null,"","","","","","","","",null,2,2,"S",1,null,null,"","","","","","","","",null,4,4,"I",2,null,null,"","","","","","","","",null,8,8,"I",3,null,null,"","","","","","","","",null,1,1,"I",0,null,null,"","","","","","","",""]
[null,null,"AR0012","Klebsiella pneumoniae",">",128,256,"R",8,null,null,"","","","","","","","",null,16,16,"R",4,null,null,"","","","","","","","",">",16,32,"R",5,null,null,"","","","","","","","",null,16,16,"R",4,null,null,"","","","","","","","",null,0.5,0.5,"I",-1,null,null,"","","","","","","",""]
[null,null,"AR0013","Escherichia coli","<=",4,4,"S",2,null,null,"","","","","","","","",">",16,32,"R",5,null,null,"","","","","","","","",null,8,8,"R",3,null,null,"","","","","","","","",null,2,2,"S",1,null,null,"","","","","","","","",null,0.5,0.5,"I",-1,null,null,"","","","","","","",""]
[null,null,"AR0014","Escherichia coli",null,8,8,"S",3,null,null,"","","","","","","","",">",16,32,"R",5,null,null,"","","","","","","","",">",16,32,"R",5,null,null,"","","","","","","","",null,4,4,"S",2,null,null,"","","","","","","","",null,0.5,0.5,"I",-1,null,null,"","","","","","","",""]
[null,null,"AR0015","Escherichia coli",">",128,256,"R",8,null,null,"","","","","","","","",">",16,32,"R",5,null,null,"","","","","","","","",">",16,32,"R",5,null,null,"","","","","","","","",null,16,16,"R",4,null,null,"","","","","","","","",null,0.5,0.5,"I",-1,null,null,"","","","","","","",""]
[null,null,"AR0017","Escherichia coli","<=",4,4,"S",2,null,null,"","","","","","","","",null,1,1,"S",0,null,null,"","","","","","","","",null,1,1,"S",0,null,null,"","","","","","","","",null,4,4,"S",2,null,null,"","","","","","","","",null,0.5,0.5,"I",-1,null,null,"","","","","","","",""]
[null,null,"AR0018","Klebsiella aerogenes","<=",4,4,"S",2,null,null,"","","","","","","","",null,0.5,0.5,"S",-1,null,null,"","","","","","","","","<=",0.5,0.5,"S",-1,null,null,"","","","","","","","","<=",1,1,"S",0,null,null,"","","","","","","","",null,0.5,0.5,"I",-1,null,null,"","","","","","","",""]
[null,null,"AR0019","Escherichia coli","<=",4,4,"S",2,null,null,"","","","","","","","","<=",0.25,0.25,"S",-2,null,null,"","","","","","","","","<=",0.5,0.5,"S",-1,null,null,"","","","","","","","","<=",1,1,"S",0,null,null,"","","","","","","","",null,0.5,0.5,"I",-1,null,null,"","","","","","","",""]
[null,null,"AR0020","Escherichia coli","<=",4,4,"S",2,null,null,"","","","","","","","",null,2,2,"S",1,null,null,"","","","","","","","",null,2,2,"S",1,null,null,"","","","","","","","",null,2,2,"S",1,null,null,"","","","","","","","",null,0.5,0.5,"I",-1,null,null,"","","","","","","",""]
[null,null,"AR0022","Citrobacter freundii","<=",4,4,"S",2,null,null,"","","","","","","","","<=",0.25,0.25,"S",-2,null,null,"","","","","","","","","<=",0.5,0.5,"S",-1,null,null,"","","","","","","","","<=",1,1,"S",0,null,null,"","","","","","","","",null,0.5,0.5,"I",-1,null,null,"","","","","","","",""]
[null,null,"AR0024","Citrobacter koseri","<=",4,4,"S",2,null,null,"","","","","","","","",null,0.5,0.5,"S",-1,null,null,"","","","","","","","",null,0.5,0.5,"S",-1,null,null,"","","","","","","","","<=",1,1,"S",0,null,null,"","","","","","","","",null,1,1,"I",0,null,null,"","","","","","","",""]
[null,null,"AR0025","Citrobacter koseri",null,16,16,"SDD",4,null,null,"","","","","","","","",">",16,32,"R",5,null,null,"","","","","","","","",null,4,4,"I",2,null,null,"","","","","","","","",null,2,2,"S",1,null,null,"","","","","","","","",null,0.5,0.5,"I",-1,null,null,"","","","","","","",""]
[null,null,"AR0026","Providencia stuartii","<=",4,4,"S",2,null,null,"","","","","","","","",null,0.5,0.5,"S",-1,null,null,"","","","","","","","","<=",0.25,0.25,"S",-2,null,null,"","","","","","","","","<=",1,1,"S",0,null,null,"","","","","","","",""]
[null,null,"AR0027","Serratia marcescens","<=",4,4,"S",2,null,null,"","","","","","","","","<=",0.25,0.25,"S",-2,null,null,"","","","","","","","",null,0.5,0.5,"S",-1,null,null,"","","","","","","","","<=",1,1,"S",0,null,null,"","","","","","","","",">",8,16,"R",4,null,null,"","","","","","","",""]
[null,null,"AR0028","Klebsiella oxytoca","<=",4,4,"S",2,null,null,"","","","","","","","",null,0.5,0.5,"S",-1,null,null,"","","","","","","","",null,0.5,0.5,"S",-1,null,null,"","","","","","","","","<=",1,1,"S",0,null,null,"","","","","","","","",null,0.5,0.5,"I",-1,null,null,"","","","","","","",""]
[null,null,"AR0029","Proteus mirabilis","<=",4,4,"S",2,null,null,"","","","","","","","",null,1,1,"S",0,null,null,"","","","","","","","",null,1,1,"S",0,null,null,"","","","","","","","",null,4,4,"S",2,null,null,"","","","","","","",""]
[null,null,"AR0038","Enterobacter cloacae",">",128,256,"R",8,null,null,"","","","","","","","",">",16,32,"R",5,null,null,"","","","","","","","",">",16,32,"R",5,null,null,"","","","","","","","",">",64,128,"R",7,null,null,"","","","","","","","",null,0.5,0.5,"I",-1,null,null,"","","","","","","",""]
[null,null,"AR0039","Klebsiella pneumoniae",">",128,256,"R",8,null,null,"","","","","","","","",null,8,8,"R",3,null,null,"","","","","","","","",null,16,16,"R",4,null,null,"","","","","","","","",null,4,4,"S",2,null,null,"","","","","","","","",null,0.5,0.5,"I",-1,null,null,"","","","","","","",""]
[null,null,"AR0040","Klebsiella pneumoniae",">",128,256,"R",8,null,null,"","","","","","","","",">",16,32,"R",5,null,null,"","","","","","","","",">",16,{"$f":"IF(AND(AJ31<>\"\"),IF(AI31=\">\",AJ31*2,AJ31*1),\"\")","v":32},"R",{"$f":"IF(ISNUMBER(AK31),ROUND(IMLOG2(AK31),1),\"\")","v":5},null,null,{"$f":"IF(AND(ISNUMBER(AO31)),IF(AN31=\">\",AO31*2,AO31),\"\")","v":""},"",{"$f":"IF(ISNUMBER(AP31),ROUND(IMLOG2(AP31),1),\"\")","v":""},{"$f":"IF(ISNUMBER(AP31),IF(AND(AI31=\">\",AP31>=AK31),\"YES\",IF(AND(OR(AN31=\">\",AN31=\">=\"),AK31>AP31),\"YES\",IF(AND(AI31=\"<=\",AP31<AK31),\"YES\",IF(AND(AN31=\"<=\",AK31<AP31),\"YES\",IF(ABS(AR31-AM31)<=1,\"YES\",\"NO\"))))),\"\")","v":""},{"$f":"IF(ISNUMBER(AO31),IF(AND(AI31=\"<=\",AR31<=AM31), \"No\", IF(AND(AI31=\"<=\", AN31=\"<=\"), \"No\", IF(AND(AI31=\">\",AR31>=AM31), \"No\", IF(AND(AN31=\"<=\", AM31<=AR31), \"No\", IF(AND(OR(AN31=\">\",AN31=\">=\"),AM31>=AR31), \"No\", \"yes\"))))),\"\")","v":""},{"$f":"IF(ISNUMBER(AO31),IF(AND(AN31=\"<=\",AI31=\"<=\"),0,IF(AND(OR(AN31=\">\",AN31=\">=\"),AI31=\">\"),0,IF(AND(AN31=\"<=\",AM31<AR31),0, IF(AND(AI31=\"<=\", AR31<AM31),0,IF(AND(OR(AI31=\">\", AI31=\">=\"),AR31>AM31),0,IF(AND(OR(AN31=\">\", AN31=\">=\"),AM31>AR31),0,IF(ISNUMBER(AO31),AR31-AM31,\"\"))))))),\"\")","v":""},{"$f":"IF(AQ31<>\"\",IF(EXACT(AQ31,AL31),\"YES\",\"NO\"),\"\")","v":""},{"$f":"IF(AQ31<>\"\", IF(AND(AL31=\"I\",OR(AQ31=\"S\",AQ31=\"R\")),\"minE\",IF(AND(AQ31=\"I\",OR(AL31=\"S\",AL31=\"R\")),\"minE\",IF(AND(AL31=\"R\",AQ31=\"S\"),\"VME\",IF(AND(AL31=\"S\",AQ31=\"R\"),\"ME\",\"\")))),\"\")","v":""},null,16,{"$f":"IF(AND(AY31<>\"\"),IF(AX31=\">\",AY31*2,AY31*1),\"\")","v":16},"R",{"$f":"IF(ISNUMBER(AZ31),ROUND(IMLOG2(AZ31),1),\"\")","v":4},null,null,{"$f":"IF(AND(ISNUMBER(BD31)),IF(BC31=\">\",BD31*2,BD31),\"\")","v":""},"",{"$f":"IF(ISNUMBER(BE31),ROUND(IMLOG2(BE31),1),\"\")","v":""},{"$f":"IF(ISNUMBER(BE31),IF(AND(AX31=\">\",BE31>=AZ31),\"YES\",IF(AND(OR(BC31=\">\",BC31=\">=\"),AZ31>BE31),\"YES\",IF(AND(AX31=\"<=\",BE31<AZ31),\"YES\",IF(AND(BC31=\"<=\",AZ31<BE31),\"YES\",IF(ABS(BG31-BB31)<=1,\"YES\",\"NO\"))))),\"\")","v":""},{"$f":"IF(ISNUMBER(BD31),IF(AND(AX31=\"<=\",BG31<=BB31), \"No\", IF(AND(AX31=\"<=\", BC31=\"<=\"), \"No\", IF(AND(AX31=\">\",BG31>=BB31), \"No\", IF(AND(BC31=\"<=\", BB31<=BG31), \"No\", IF(AND(OR(BC31=\">\",BC31=\">=\"),BB31>=BG31), \"No\", \"yes\"))))),\"\")","v":""},{"$f":"IF(ISNUMBER(BD31),IF(AND(BC31=\"<=\",AX31=\"<=\"),0,IF(AND(OR(BC31=\">\",BC31=\">=\"),AX31=\">\"),0,IF(AND(BC31=\"<=\",BB31<BG31),0, IF(AND(AX31=\"<=\", BG31<BB31),0,IF(AND(OR(AX31=\">\", AX31=\">=\"),BG31>BB31),0,IF(AND(OR(BC31=\">\", BC31=\">=\"),BB31>BG31),0,IF(ISNUMBER(BD31),BG31-BB31,\"\"))))))),\"\")","v":""},{"$f":"IF(BF31<>\"\",IF(EXACT(BF31,BA31),\"YES\",\"NO\"),\"\")","v":""},{"$f":"IF(BF31<>\"\", IF(AND(BA31=\"I\",OR(BF31=\"S\",BF31=\"R\")),\"minE\",IF(AND(BF31=\"I\",OR(BA31=\"S\",BA31=\"R\")),\"minE\",IF(AND(BA31=\"R\",BF31=\"S\"),\"VME\",IF(AND(BA31=\"S\",BF31=\"R\"),\"ME\",\"\")))),\"\")","v":""},null,8,8,"R",3,null,null,"","","","","","","",""]
[null,null,"AR0044","Klebsiella pneumoniae",">",128,256,"R",8,null,null,"","","","","","","","",">",16,32,"R",5,null,null,"","","","","","","","",">",16,32,"R",5,null,null,"","","","","","","","",null,16,16,"R",4,null,null,"","","","","","","","",null,0.5,0.5,"I",-1,null,null,"","","","","","","",""]
[null,null,"AR0048","Escherichia coli",">",128,256,"R",8,null,null,"","","","","","","","",">",16,32,"R",5,null,null,"","","","","","","","",">",16,32,"R",5,null,null,"","","","","","","","",">",64,128,"R",7,null,null,"","","","","","","","",null,0.5,0.5,"I",-1,null,null,"","","","","","","",""]
[null,null,"AR0053","Enterobacter cloacae",">",128,256,"R",8,null,null,"","","","","","","","",null,8,8,"R",3,null,null,"","","","","","","","",">",16,32,"R",5,null,null,"","","","","","","","",null,32,32,"R",5,null,null,"","","","","","","","",null,0.5,0.5,"I",-1,null,null,"","","","","","","",""]
[null,null,"AR0061","Escherichia coli",">",128,256,"R",8,null,null,"","","","","","","","",">",16,32,"R",5,null,null,"","","","","","","","",">",16,32,"R",5,null,null,"","","","","","","","",null,16,16,"R",4,null,null,"","","","","","","","",null,0.5,0.5,"I",-1,null,null,"","","","","","","",""]
[null,null,"AR0074","Klebsiella aerogenes",">",128,256,"R",8,null,null,"","","","","","","","","<=",0.25,0.25,"S",-2,null,null,"","","","","","","","",null,1,1,"S",0,null,null,"","","","","","","","","<=",1,1,"S",0,null,null,"","","","","","","","",null,0.5,0.5,"I",-1,null,null,"","","","","","","",""]
[null,null,"AR0075","Klebsiella pneumoniae",">",128,256,"R",8,null,null,"","","","","","","","",">",16,32,"R",5,null,null,"","","","","","","","",">",16,32,"R",5,null,null,"","","","","","","","",">",64,128,"R",7,null,null,"","","","","","","","",null,0.5,0.5,"I",-1,null,null,"","","","","","","",""]
[null,null,"AR0077","Escherichia coli","<=",4,4,"S",2,null,null,"","","","","","","","",null,1,1,"S",0,null,null,"","","","","","","","",null,1,1,"S",0,null,null,"","","","","","","","",null,2,2,"S",1,null,null,"","","","","","","","",null,0.5,0.5,"I",-1,null,null,"","","","","","","",""]
[null,null,"AR0091","Serratia marcescens","<=",4,{"$f":"IF(AND(F39<>\"\"),IF(E39=\">\",F39*2,F39*1),\"\")","v":4},"S",{"$f":"IF(ISNUMBER(G39),ROUND(IMLOG2(G39),1),\"\")","v":2},null,null,"","","","","","","","",null,1,{"$f":"IF(AND(U39<>\"\"),IF(T39=\">\",U39*2,U39*1),\"\")","v":1},"S",{"$f":"IF(ISNUMBER(V39),ROUND(IMLOG2(V39),1),\"\")","v":0},null,null,"","","","","","","","",null,4,4,"I",2,null,null,"","","","","","","","",null,4,4,"S",2,null,null,"","","","","","","",""]
[null,null,"AR0098","Klebsiella pneumoniae",">",128,256,"R",8,null,null,"","","","","","","","",">",16,32,{"$f":"IF((ISNUMBER(V40)),\nIF(V40<=2,\"S\",\nIF(V40=4,\"I\",\nIF(V40>=8,\"R\", \"\"))),\"\")","v":"R"},5,null,null,"","","",{"$f":"IF(ISNUMBER(AA40),IF(AND(T40=\">\",AA40>=V40),\"YES\",IF(AND(OR(Y40=\">\",Y40=\">=\"),V40>AA40),\"YES\",IF(AND(T40=\"<=\",AA40<V40),\"YES\",IF(AND(Y40=\"<=\",V40<AA40),\"YES\",IF(ABS(AC40-X40)<=1,\"YES\",\"NO\"))))),\"\")","v":""},{"$f":"IF(ISNUMBER(Z40),IF(AND(T40=\"<=\",AC40<=X40), \"No\", IF(AND(T40=\"<=\", Y40=\"<=\"), \"No\", IF(AND(T40=\">\",AC40>=X40), \"No\", IF(AND(Y40=\"<=\", X40<=AC40), \"No\", IF(AND(OR(Y40=\">\",Y40=\">=\"),X40>=AC40), \"No\", \"yes\"))))),\"\")","v":""},{"$f":"IF(ISNUMBER(Z40),IF(AND(Y40=\"<=\",T40=\"<=\"),0,IF(AND(OR(Y40=\">\",Y40=\">=\"),T40=\">\"),0,IF(AND(Y40=\"<=\",X40<AC40),0, IF(AND(T40=\"<=\", AC40<X40),0,IF(AND(OR(T40=\">\", T40=\">=\"),AC40>X40),0,IF(AND(OR(Y40=\">\", Y40=\">=\"),X40>AC40),0,IF(ISNUMBER(Z40),AC40-X40,\"\"))))))),\"\")","v":""},{"$f":"IF(AB40<>\"\",IF(EXACT(AB40,W40),\"YES\",\"NO\"),\"\")","v":""},{"$f":"IF(AB40<>\"\", IF(AND(W40=\"I\",OR(AB40=\"S\",AB40=\"R\")),\"minE\",IF(AND(AB40=\"I\",OR(W40=\"S\",W40=\"R\")),\"minE\",IF(AND(W40=\"R\",AB40=\"S\"),\"VME\",IF(AND(W40=\"S\",AB40=\"R\"),\"ME\",\"\")))),\"\")","v":""},">",16,32,"R",5,null,null,"","","","","","","","",null,32,32,"R",5,null,null,"","","","","","","","","<=",0.25,0.25,"I",-2,null,null,"","","","","","","",""]
[null,null,null,null,null,null,null,null,null,null,null,null,null,null,null,null,null,null,null,null,null,null,null,null,null,null,null,null,null,null,null,null,null,null,null,null,null,null,null,null,null,null,null,null,null,null,null,null,null,null,null,null,null,null,null,null,null,null,null,null,null,null,null,null,"Note: Organisms with intrinsic resistance should not be included. See M100 Appendix B."]
[null,null,null,null,null,null,null,null,null,"Summary Data",null,null,null,null,null,null,null,null,null,null,null,null,null,null,"Summary Data",null,null,null,null,null,null,null,null,null,null,null,null,null,null,"Summary Data",null,null,null,null,null,null,null,null,null,null,null,null,null,null,"Summary Data",null,null,null,null,null,null,null,null,null,null,null,null,null,null,"Summary Data"]
[null,null,null,null,null,null,null,null,null,"%","N",null,"Total N",null,null,null,null,null,null,null,null,null,null,null,"%","N",null,"Total N",null,null,null,null,null,null,null,null,null,null,null,"%","N",null,"Total N",null,null,null,null,null,null,null,null,null,null,null,"%","N",null,"Total N",null,null,null,null,null,null,null,null,null,null,null,"%","N",null,"Total N"]
[null,null,null,null,null,null,null,"EA",null,{"$f":"IF(M44=0,\"\",K44/M44)","v":""},{"$f":"COUNTIF(O7:O40, \"YES\")","v":0},null,{"$f":"COUNTIFS( K7:K40,\">0\")","v":0},null,null,null,null,null,null,null,null,null,"EA",null,{"$f":"IF(AB44=0,\"\",Z44/AB44)","v":""},{"$f":"COUNTIF(AD7:AD40, \"YES\")","v":0},null,{"$f":"COUNTIFS( Z7:Z40,\">0\")","v":0},null,null,null,null,null,null,null,null,null,"EA",null,{"$f":"IF(AQ44=0,\"\",AO44/AQ44)","v":""},{"$f":"COUNTIF(AS7:AS40, \"YES\")","v":0},null,{"$f":"COUNTIFS( AO7:AO40,\">0\")","v":0},null,null,null,null,null,null,null,null,null,"EA",null,{"$f":"IF(BF44=0,\"\",BD44/BF44)","v":""},{"$f":"COUNTIF(BH7:BH40, \"YES\")","v":0},null,{"$f":"COUNTIFS( BD7:BD40,\">0\")","v":0},null,null,null,null,null,null,null,null,null,"EA",null,{"$f":"IF(BU44=0,\"\",BS44/BU44)","v":""},{"$f":"COUNTIF(BW7:BW40, \"YES\")","v":0},null,{"$f":"COUNTIFS( BS7:BS40,\">0\")","v":0}]
[null,null,null,null,null,null,null,"CA",null,{"$f":"IF(M45=0,\"\",K45/M45)","v":""},{"$f":"COUNTIF(R7:R40, \"YES\")","v":0},null,{"$f":"COUNTIFS( M7:M40,\"R\")+COUNTIFS( M7:M40,\"SDD\")+COUNTIFS( M7:M40,\"S\")","v":0},null,null,null,null,null,null,null,null,null,"CA",null,{"$f":"IF(AB45=0,\"\",Z45/AB45)","v":""},{"$f":"COUNTIF(AG7:AG40, \"YES\")","v":0},null,{"$f":"COUNTIFS( AB7:AB40,\"R\")+COUNTIFS( AB7:AB40,\"I\")+COUNTIFS( AB7:AB40,\"S\")","v":0},null,null,null,null,null,null,null,null,null,"CA",null,{"$f":"IF(AQ45=0,\"\",AO45/AQ45)","v":""},{"$f":"COUNTIF(AV7:AV40, \"YES\")","v":0},null,{"$f":"COUNTIFS( AQ7:AQ40,\"R\")+COUNTIFS( AQ7:AQ40,\"I\")+COUNTIFS( AQ7:AQ40,\"S\")","v":0},null,null,null,null,null,null,null,null,null,"CA",null,{"$f":"IF(BF45=0,\"\",BD45/BF45)","v":""},{"$f":"COUNTIF(BK7:BK40, \"YES\")","v":0},null,{"$f":"COUNTIFS( BF7:BF40,\"R\")+COUNTIFS( BF7:BF40,\"I\")+COUNTIFS( BF7:BF40,\"S\")","v":0},null,null,null,null,null,null,null,null,null,"CA",null,{"$f":"IF(BU45=0,\"\",BS45/BU45)","v":""},{"$f":"COUNTIF(BZ7:BZ40, \"YES\")","v":0},null,{"$f":"COUNTIFS( BU7:BU40,\"R\")+COUNTIFS( BU7:BU40,\"I\")+COUNTIFS( BU7:BU40,\"S\")","v":0}]
[null,null,null,null,null,null,null,"minE",null,"",{"$f":"COUNTIF(S7:S40, \"minE\")","v":0},null,{"$f":"M45","v":0},null,null,null,null,null,null,null,null,null,"minE",null,"",{"$f":"COUNTIF(AH7:AH40, \"minE\")","v":0},null,{"$f":"AB45","v":0},null,null,null,null,null,null,null,null,null,"minE",null,"",{"$f":"COUNTIF(AW7:AW40, \"minE\")","v":0},null,{"$f":"AQ45","v":0},null,null,null,null,null,null,null,null,null,"minE",null,"",{"$f":"COUNTIF(BL7:BL40, \"minE\")","v":0},null,{"$f":"BF45","v":0},null,null,null,null,null,null,null,null,null,"minE",null,"",{"$f":"COUNTIF(CA7:CA40, \"minE\")","v":0},null,{"$f":"BU45","v":0}]
[null,null,null,null,null,null,null,"ME",null,{"$f":"IF(M45=0, \"\",K47/M47)","v":""},{"$f":"COUNTIFS( S7:S40, \"ME\")","v":0},null,{"$f":"COUNTIFS( H7:H40,\"S\", K7:K40, \">0\")","v":0},null,null,null,null,null,null,null,null,null,"ME",null,{"$f":"IF(AB45=0, \"\",Z47/AB47)","v":""},{"$f":"COUNTIFS( AH7:AH40, \"ME\")","v":0},null,{"$f":"COUNTIFS( W7:W40,\"S\", Z7:Z40, \">0\")","v":0},null,null,null,null,null,null,null,null,null,"ME",null,{"$f":"IF(AQ45=0, \"\",AO47/AQ47)","v":""},{"$f":"COUNTIFS( AW7:AW40, \"ME\")","v":0},null,{"$f":"COUNTIFS( AL7:AL40,\"S\", AO7:AO40, \">0\")","v":0},null,null,null,null,null,null,null,null,null,"ME",null,{"$f":"IF(BF45=0, \"\",BD47/BF47)","v":""},{"$f":"COUNTIFS( BL7:BL40, \"ME\")","v":0},null,{"$f":"COUNTIFS( BA7:BA40,\"S\", BD7:BD40, \">0\")","v":0},null,null,null,null,null,null,null,null,null,"ME",null,{"$f":"IF(BU45=0, \"\",BS47/BU47)","v":""},{"$f":"COUNTIFS( CA7:CA40, \"ME\")","v":0},null,{"$f":"COUNTIFS( BP7:BP40,\"S\", BS7:BS40, \">0\")","v":0}]
[null,null,null,null,null,null,null,"VME",null,{"$f":"IF(M45=0,\"\",K48/M48)","v":""},{"$f":"COUNTIFS(S7:S40, \"VME\")","v":0},null,{"$f":"COUNTIFS( H7:H40,\"R\",K7:K40, \">0\")","v":0},null,null,null,null,null,null,null,null,null,"VME",null,{"$f":"IF(AB45=0,\"\",Z48/AB48)","v":""},{"$f":"COUNTIFS(AH7:AH40, \"VME\")","v":0},null,{"$f":"COUNTIFS( W7:W40,\"R\",Z7:Z40, \">0\")","v":0},null,null,null,null,null,null,null,null,null,"VME",null,{"$f":"IF(AQ45=0,\"\",AO48/AQ48)","v":""},{"$f":"COUNTIFS(AW7:AW40, \"VME\")","v":0},null,{"$f":"COUNTIFS( AL7:AL40,\"R\",AO7:AO40, \">0\")","v":0},null,null,null,null,null,null,null,null,null,"VME",null,{"$f":"IF(BF45=0,\"\",BD48/BF48)","v":""},{"$f":"COUNTIFS(BL7:BL40, \"VME\")","v":0},null,{"$f":"COUNTIFS( BA7:BA40,\"R\",BD7:BD40, \">0\")","v":0},null,null,null,null,null,null,null,null,null,"VME",null,{"$f":"IF(BU45=0,\"\",BS48/BU48)","v":""},{"$f":"COUNTIFS(CA7:CA40, \"VME\")","v":0},null,{"$f":"COUNTIFS( BP7:BP40,\"R\",BS7:BS40, \">0\")","v":0}]

{"sheet":"BIT-2 Precision","index":6,"n_rows":50,"n_cols":25,"rows_kept":50,"cut":false,"hidden":false,"merged":[[32,1,32,20],[4,2,4,3],[4,4,4,5],[4,6,4,7],[13,2,13,3],[13,4,13,5],[13,6,13,7],[7,17,10,20],[26,17,29,20],[12,1,12,20],[33,4,33,5],[33,6,33,7],[43,2,43,3],[43,4,43,5],[43,6,43,7],[42,1,42,20],[36,17,39,20],[46,17,49,20],[1,0,1,20],[43,0,44,0],[43,1,44,1],[43,8,44,8],[23,0,24,0],[23,1,24,1],[23,8,24,8],[33,0,34,0],[33,1,34,1],[33,8,34,8],[4,0,5,0],[4,1,5,1],[4,8,5,8],[3,1,3,20],[33,2,33,3],[13,0,14,0],[13,1,14,1],[13,8,14,8],[16,17,19,20],[23,2,23,3],[23,4,23,5],[23,6,23,7],[22,1,22,20]]}
[null,null,null,null,null,null,null,null,null,null,null,null,null,null,null,null,null,null,null,null,null,null,null,"Interp","Number"]
["Precision (Reproducibility) for BIT-2 (AR Bank Panel PTA)",null,null,null,null,null,null,null,null,null,null,null,null,null,null,null,null,null,null,null,null,null,1,"S",1]
[null,null,null,null,null,null,null,null,null,null,null,null,null,null,null,null,null,null,null,null,null,null,2,"I",2]
[null,"Amikacin",null,null,null,null,null,null,null,null,null,null,null,null,null,null,null,null,null,null,null,null,3,"R",3]
["Isolate","Organism","Result 1",null,"Result 2",null,"Result 3",null,"Interpretation Mode or Median","Result 1","Result 2","Result 3","Mode","Result 1","Result 2","Result 3",null,null,"N","%","N Results Total",null,4,"SDD",4]
[null,null,"Intials, Date Tested","Interp","Intials, Date Tested","Interp","Intials, Date Tested","Interp",null,"Equivalency","Equivalency","Equivalency","Interp","Interp","Interp","Interp",null,"Category Equivalency",{"$f":"COUNTIF(J7:L11,\"Yes\")","v":0},{"$f":"IF(U6>0, S6/U6,\"\")","v":""},{"$f":"COUNTIF(J7:L11,\"Yes\")+COUNTIF(J7:L11,\"No\")","v":0}]
[null,null,null,null,null,null,null,null,{"$f":"IF(M7<>\"\",VLOOKUP(M7,NUM_SIR,2, FALSE),\"\")","v":""},{"$f":"IF(AND($M7<>\"\",N7<>\"\"),IF(N7=$M7, \"Yes\",\"No\"),\"\")","v":""},"","",{"$f":"IF(SUM(N7:P7)>0,IF(ISERROR(MODE(N7:P7)),MEDIAN(N7:P7),MODE(N7:P7)),\"\")","v":""},{"$f":"IF(D7<>\"\",VLOOKUP(D7,SIR_NUM,2,FALSE),\"\")","v":""},{"$f":"IF(F7<>\"\",VLOOKUP(F7,SIR_NUM,2,FALSE),\"\")","v":""},{"$f":"IF(H7<>\"\",VLOOKUP(H7,SIR_NUM,2,FALSE),\"\")","v":""},null,null,null,null,null,null,null,"Interp","Number"]
[null,null,null,null,null,null,null,null,{"$f":"IF(M8<>\"\",VLOOKUP(M8,NUM_SIR,2, FALSE),\"\")","v":""},"","","",{"$f":"IF(SUM(N8:P8)>0,IF(ISERROR(MODE(N8:P8)),MEDIAN(N8:P8),MODE(N8:P8)),\"\")","v":""},{"$f":"IF(D8<>\"\",VLOOKUP(D8,SIR_NUM,2,FALSE),\"\")","v":""},{"$f":"IF(F8<>\"\",VLOOKUP(F8,SIR_NUM,2,FALSE),\"\")","v":""},{"$f":"IF(H8<>\"\",VLOOKUP(H8,SIR_NUM,2,FALSE),\"\")","v":""},null,0,null,null,null,null,1,"S",1]
[null,null,null,null,null,null,null,null,{"$f":"IF(M9<>\"\",VLOOKUP(M9,NUM_SIR,2, FALSE),\"\")","v":""},"","","",{"$f":"IF(SUM(N9:P9)>0,IF(ISERROR(MODE(N9:P9)),MEDIAN(N9:P9),MODE(N9:P9)),\"\")","v":""},{"$f":"IF(D9<>\"\",VLOOKUP(D9,SIR_NUM,2,FALSE),\"\")","v":""},{"$f":"IF(F9<>\"\",VLOOKUP(F9,SIR_NUM,2,FALSE),\"\")","v":""},{"$f":"IF(H9<>\"\",VLOOKUP(H9,SIR_NUM,2,FALSE),\"\")","v":""},null,null,null,null,null,null,2,"SDD",2]
[null,null,null,null,null,null,null,null,{"$f":"IF(M10<>\"\",VLOOKUP(M10,NUM_SIR,2, FALSE),\"\")","v":""},"","","",{"$f":"IF(SUM(N10:P10)>0,IF(ISERROR(MODE(N10:P10)),MEDIAN(N10:P10),MODE(N10:P10)),\"\")","v":""},{"$f":"IF(D10<>\"\",VLOOKUP(D10,SIR_NUM,2,FALSE),\"\")","v":""},{"$f":"IF(F10<>\"\",VLOOKUP(F10,SIR_NUM,2,FALSE),\"\")","v":""},{"$f":"IF(H10<>\"\",VLOOKUP(H10,SIR_NUM,2,FALSE),\"\")","v":""},null,null,null,null,null,null,3,"R",3]
[null,null,null,null,null,null,null,null,{"$f":"IF(M11<>\"\",VLOOKUP(M11,NUM_SIR,2, FALSE),\"\")","v":""},"","","",{"$f":"IF(SUM(N11:P11)>0,IF(ISERROR(MODE(N11:P11)),MEDIAN(N11:P11),MODE(N11:P11)),\"\")","v":""},{"$f":"IF(D11<>\"\",VLOOKUP(D11,SIR_NUM,2,FALSE),\"\")","v":""},{"$f":"IF(F11<>\"\",VLOOKUP(F11,SIR_NUM,2,FALSE),\"\")","v":""},{"$f":"IF(H11<>\"\",VLOOKUP(H11,SIR_NUM,2,FALSE),\"\")","v":""}]
[]
[null,"Colistin"]
["Isolate","Organism","Result 1",null,"Result 2",null,"Result 3",null,"Interpretation Mode or Median","Result 1","Result 2","Result 3","Mode","Result 1","Result 2","Result 3",null,null,"N","%","N Results Total"]
[null,null,"Intials, Date Tested","Interp","Intials, Date Tested","Interp","Intials, Date Tested","Interp",null,"Equivalency","Equivalency","Equivalency","Interp","Interp","Interp","Interp",null,"Category Equivalency",{"$f":"COUNTIF(J16:L20,\"Yes\")","v":0},{"$f":"IF(U15>0, S15/U15,\"\")","v":""},{"$f":"COUNTIF(J16:L20,\"Yes\")+COUNTIF(J16:L20,\"No\")","v":0}]
[null,null,null,null,null,null,null,null,{"$f":"IF(M16<>\"\",VLOOKUP(M16,NUM_SIR,2, FALSE),\"\")","v":""},{"$f":"IF(AND($M16<>\"\",N16<>\"\"),IF(N16=$M16, \"Yes\",\"No\"),\"\")","v":""},{"$f":"IF(AND($M16<>\"\",O16<>\"\"),IF(O16=$M16, \"Yes\",\"No\"),\"\")","v":""},{"$f":"IF(AND($M16<>\"\",P16<>\"\"),IF(P16=$M16, \"Yes\",\"No\"),\"\")","v":""},{"$f":"IF(SUM(N16:P16)>0,IF(ISERROR(MODE(N16:P16)),MEDIAN(N16:P16),MODE(N16:P16)),\"\")","v":""},{"$f":"IF(D16<>\"\",VLOOKUP(D16,SIR_NUM,2,FALSE),\"\")","v":""},{"$f":"IF(F16<>\"\",VLOOKUP(F16,SIR_NUM,2,FALSE),\"\")","v":""},{"$f":"IF(H16<>\"\",VLOOKUP(H16,SIR_NUM,2,FALSE),\"\")","v":""}]
[null,null,null,null,null,null,null,null,{"$f":"IF(M17<>\"\",VLOOKUP(M17,NUM_SIR,2, FALSE),\"\")","v":""},"","","",{"$f":"IF(SUM(N17:P17)>0,IF(ISERROR(MODE(N17:P17)),MEDIAN(N17:P17),MODE(N17:P17)),\"\")","v":""},{"$f":"IF(D17<>\"\",VLOOKUP(D17,SIR_NUM,2,FALSE),\"\")","v":""},{"$f":"IF(F17<>\"\",VLOOKUP(F17,SIR_NUM,2,FALSE),\"\")","v":""},{"$f":"IF(H17<>\"\",VLOOKUP(H17,SIR_NUM,2,FALSE),\"\")","v":""},null,0]
[null,null,null,null,null,null,null,null,{"$f":"IF(M18<>\"\",VLOOKUP(M18,NUM_SIR,2, FALSE),\"\")","v":""},"","","",{"$f":"IF(SUM(N18:P18)>0,IF(ISERROR(MODE(N18:P18)),MEDIAN(N18:P18),MODE(N18:P18)),\"\")","v":""},{"$f":"IF(D18<>\"\",VLOOKUP(D18,SIR_NUM,2,FALSE),\"\")","v":""},{"$f":"IF(F18<>\"\",VLOOKUP(F18,SIR_NUM,2,FALSE),\"\")","v":""},{"$f":"IF(H18<>\"\",VLOOKUP(H18,SIR_NUM,2,FALSE),\"\")","v":""}]
[null,null,null,null,null,null,null,null,{"$f":"IF(M19<>\"\",VLOOKUP(M19,NUM_SIR,2, FALSE),\"\")","v":""},"","","",{"$f":"IF(SUM(N19:P19)>0,IF(ISERROR(MODE(N19:P19)),MEDIAN(N19:P19),MODE(N19:P19)),\"\")","v":""},{"$f":"IF(D19<>\"\",VLOOKUP(D19,SIR_NUM,2,FALSE),\"\")","v":""},{"$f":"IF(F19<>\"\",VLOOKUP(F19,SIR_NUM,2,FALSE),\"\")","v":""},{"$f":"IF(H19<>\"\",VLOOKUP(H19,SIR_NUM,2,FALSE),\"\")","v":""}]
[null,null,null,null,null,null,null,null,{"$f":"IF(M20<>\"\",VLOOKUP(M20,NUM_SIR,2, FALSE),\"\")","v":""},"","","",{"$f":"IF(SUM(N20:P20)>0,IF(ISERROR(MODE(N20:P20)),MEDIAN(N20:P20),MODE(N20:P20)),\"\")","v":""},{"$f":"IF(D20<>\"\",VLOOKUP(D20,SIR_NUM,2,FALSE),\"\")","v":""},{"$f":"IF(F20<>\"\",VLOOKUP(F20,SIR_NUM,2,FALSE),\"\")","v":""},{"$f":"IF(H20<>\"\",VLOOKUP(H20,SIR_NUM,2,FALSE),\"\")","v":""}]
[]
[]
[null,"Gentamicin"]
["Isolate","Organism","Result 1",null,"Result 2",null,"Result 3",null,"Interpretation Mode or Median","Result 1","Result 2","Result 3","Mode","Result 1","Result 2","Result 3",null,null,"N","%","N Results Total"]
[null,null,"Intials, Date Tested","Interp","Intials, Date Tested","Interp","Intials, Date Tested","Interp",null,"Equivalency","Equivalency","Equivalency","Interp","Interp","Interp","Interp",null,"Category Equivalency",{"$f":"COUNTIF(J26:L30,\"Yes\")","v":0},{"$f":"IF(U25>0, S25/U25,\"\")","v":""},{"$f":"COUNTIF(J26:L30,\"Yes\")+COUNTIF(J26:L30,\"No\")","v":0}]
[null,null,null,null,null,null,null,null,{"$f":"IF(M26<>\"\",VLOOKUP(M26,NUM_SIR,2, FALSE),\"\")","v":""},{"$f":"IF(AND($M26<>\"\",N26<>\"\"),IF(N26=$M26, \"Yes\",\"No\"),\"\")","v":""},"","",{"$f":"IF(SUM(N26:P26)>0,IF(ISERROR(MODE(N26:P26)),MEDIAN(N26:P26),MODE(N26:P26)),\"\")","v":""},{"$f":"IF(D26<>\"\",VLOOKUP(D26,SIR_NUM,2,FALSE),\"\")","v":""},{"$f":"IF(F26<>\"\",VLOOKUP(F26,SIR_NUM,2,FALSE),\"\")","v":""},{"$f":"IF(H26<>\"\",VLOOKUP(H26,SIR_NUM,2,FALSE),\"\")","v":""}]
[null,null,null,null,null,null,null,null,{"$f":"IF(M27<>\"\",VLOOKUP(M27,NUM_SIR,2, FALSE),\"\")","v":""},"","","",{"$f":"IF(SUM(N27:P27)>0,IF(ISERROR(MODE(N27:P27)),MEDIAN(N27:P27),MODE(N27:P27)),\"\")","v":""},{"$f":"IF(D27<>\"\",VLOOKUP(D27,SIR_NUM,2,FALSE),\"\")","v":""},{"$f":"IF(F27<>\"\",VLOOKUP(F27,SIR_NUM,2,FALSE),\"\")","v":""},{"$f":"IF(H27<>\"\",VLOOKUP(H27,SIR_NUM,2,FALSE),\"\")","v":""},null,0]
[null,null,null,null,null,null,null,null,{"$f":"IF(M28<>\"\",VLOOKUP(M28,NUM_SIR,2, FALSE),\"\")","v":""},"","","",{"$f":"IF(SUM(N28:P28)>0,IF(ISERROR(MODE(N28:P28)),MEDIAN(N28:P28),MODE(N28:P28)),\"\")","v":""},{"$f":"IF(D28<>\"\",VLOOKUP(D28,SIR_NUM,2,FALSE),\"\")","v":""},{"$f":"IF(F28<>\"\",VLOOKUP(F28,SIR_NUM,2,FALSE),\"\")","v":""},{"$f":"IF(H28<>\"\",VLOOKUP(H28,SIR_NUM,2,FALSE),\"\")","v":""}]
[null,null,null,null,null,null,null,null,{"$f":"IF(M29<>\"\",VLOOKUP(M29,NUM_SIR,2, FALSE),\"\")","v":""},"","","",{"$f":"IF(SUM(N29:P29)>0,IF(ISERROR(MODE(N29:P29)),MEDIAN(N29:P29),MODE(N29:P29)),\"\")","v":""},{"$f":"IF(D29<>\"\",VLOOKUP(D29,SIR_NUM,2,FALSE),\"\")","v":""},{"$f":"IF(F29<>\"\",VLOOKUP(F29,SIR_NUM,2,FALSE),\"\")","v":""},{"$f":"IF(H29<>\"\",VLOOKUP(H29,SIR_NUM,2,FALSE),\"\")","v":""}]
[null,null,null,null,null,null,null,null,{"$f":"IF(M30<>\"\",VLOOKUP(M30,NUM_SIR,2, FALSE),\"\")","v":""},"","","",{"$f":"IF(SUM(N30:P30)>0,IF(ISERROR(MODE(N30:P30)),MEDIAN(N30:P30),MODE(N30:P30)),\"\")","v":""},{"$f":"IF(D30<>\"\",VLOOKUP(D30,SIR_NUM,2,FALSE),\"\")","v":""},{"$f":"IF(F30<>\"\",VLOOKUP(F30,SIR_NUM,2,FALSE),\"\")","v":""},{"$f":"IF(H30<>\"\",VLOOKUP(H30,SIR_NUM,2,FALSE),\"\")","v":""}]
[]
[]
[null,"Piperacillin/tazobactam"]
["Isolate","Organism","Result 1",null,"Result 2",null,"Result 3",null,"Interpretation Mode or Median","Result 1","Result 2","Result 3","Mode","Result 1","Result 2","Result 3",null,null,"N","%","N Results Total"]
[null,null,"Intials, Date Tested","Interp","Intials, Date Tested","Interp","Intials, Date Tested","Interp",null,"Equivalency","Equivalency","Equivalency","Interp","Interp","Interp","Interp",null,"Category Equivalency",{"$f":"COUNTIF(J36:L40,\"Yes\")","v":0},{"$f":"IF(U35>0, S35/U35,\"\")","v":""},{"$f":"COUNTIF(J36:L40,\"Yes\")+COUNTIF(J36:L40,\"No\")","v":0}]
[null,null,null,null,null,null,null,null,{"$f":"IF(M36<>\"\",VLOOKUP(M36,NUM_SDD,2, FALSE),\"\")","v":""},{"$f":"IF(AND($M36<>\"\",N36<>\"\"),IF(N36=$M36, \"Yes\",\"No\"),\"\")","v":""},{"$f":"IF(AND($M36<>\"\",O36<>\"\"),IF(O36=$M36, \"Yes\",\"No\"),\"\")","v":""},{"$f":"IF(AND($M36<>\"\",P36<>\"\"),IF(P36=$M36, \"Yes\",\"No\"),\"\")","v":""},{"$f":"IF(SUM(N36:P36)>0,IF(ISERROR(MODE(N36:P36)),MEDIAN(N36:P36),MODE(N36:P36)),\"\")","v":""},{"$f":"IF(D36<>\"\",VLOOKUP(D36,SDD_NUM,2,FALSE),\"\")","v":""},{"$f":"IF(F36<>\"\",VLOOKUP(F36,SDD_NUM,2,FALSE),\"\")","v":""},{"$f":"IF(H36<>\"\",VLOOKUP(H36,SDD_NUM,2,FALSE),\"\")","v":""}]
[null,null,null,null,null,null,null,null,{"$f":"IF(M37<>\"\",VLOOKUP(M37,NUM_SDD,2, FALSE),\"\")","v":""},"","","",{"$f":"IF(SUM(N37:P37)>0,IF(ISERROR(MODE(N37:P37)),MEDIAN(N37:P37),MODE(N37:P37)),\"\")","v":""},{"$f":"IF(D37<>\"\",VLOOKUP(D37,SDD_NUM,2,FALSE),\"\")","v":""},{"$f":"IF(F37<>\"\",VLOOKUP(F37,SDD_NUM,2,FALSE),\"\")","v":""},{"$f":"IF(H37<>\"\",VLOOKUP(H37,SDD_NUM,2,FALSE),\"\")","v":""},null,0]
[null,null,null,null,null,null,null,null,{"$f":"IF(M38<>\"\",VLOOKUP(M38,NUM_SDD,2, FALSE),\"\")","v":""},"","","",{"$f":"IF(SUM(N38:P38)>0,IF(ISERROR(MODE(N38:P38)),MEDIAN(N38:P38),MODE(N38:P38)),\"\")","v":""},{"$f":"IF(D38<>\"\",VLOOKUP(D38,SDD_NUM,2,FALSE),\"\")","v":""},{"$f":"IF(F38<>\"\",VLOOKUP(F38,SDD_NUM,2,FALSE),\"\")","v":""},{"$f":"IF(H38<>\"\",VLOOKUP(H38,SDD_NUM,2,FALSE),\"\")","v":""}]
[null,null,null,null,null,null,null,null,{"$f":"IF(M39<>\"\",VLOOKUP(M39,NUM_SDD,2, FALSE),\"\")","v":""},"","","",{"$f":"IF(SUM(N39:P39)>0,IF(ISERROR(MODE(N39:P39)),MEDIAN(N39:P39),MODE(N39:P39)),\"\")","v":""},{"$f":"IF(D39<>\"\",VLOOKUP(D39,SDD_NUM,2,FALSE),\"\")","v":""},{"$f":"IF(F39<>\"\",VLOOKUP(F39,SDD_NUM,2,FALSE),\"\")","v":""},{"$f":"IF(H39<>\"\",VLOOKUP(H39,SDD_NUM,2,FALSE),\"\")","v":""}]
[null,null,null,null,null,null,null,null,{"$f":"IF(M40<>\"\",VLOOKUP(M40,NUM_SDD,2, FALSE),\"\")","v":""},"","","",{"$f":"IF(SUM(N40:P40)>0,IF(ISERROR(MODE(N40:P40)),MEDIAN(N40:P40),MODE(N40:P40)),\"\")","v":""},{"$f":"IF(D40<>\"\",VLOOKUP(D40,SDD_NUM,2,FALSE),\"\")","v":""},{"$f":"IF(F40<>\"\",VLOOKUP(F40,SDD_NUM,2,FALSE),\"\")","v":""},{"$f":"IF(H40<>\"\",VLOOKUP(H40,SDD_NUM,2,FALSE),\"\")","v":""}]
[]
[]
[null,"Tobramycin"]
["Isolate","Organism","Result 1",null,"Result 2",null,"Result 3",null,"Interpretation Mode or Median","Result 1","Result 2","Result 3","Mode","Result 1","Result 2","Result 3",null,null,"N","%","N Results Total"]
[null,null,"Intials, Date Tested","Interp","Intials, Date Tested","Interp","Intials, Date Tested","Interp",null,"Equivalency","Equivalency","Equivalency","Interp","Interp","Interp","Interp",null,"Category Equivalency",{"$f":"COUNTIF(J46:L50,\"Yes\")","v":0},{"$f":"IF(U45>0, S45/U45,\"\")","v":""},{"$f":"COUNTIF(J46:L50,\"Yes\")+COUNTIF(J46:L50,\"No\")","v":0}]
[null,null,null,null,null,null,null,null,{"$f":"IF(M46<>\"\",VLOOKUP(M46,NUM_SIR,2, FALSE),\"\")","v":""},{"$f":"IF(AND($M46<>\"\",N46<>\"\"),IF(N46=$M46, \"Yes\",\"No\"),\"\")","v":""},"","",{"$f":"IF(SUM(N46:P46)>0,IF(ISERROR(MODE(N46:P46)),MEDIAN(N46:P46),MODE(N46:P46)),\"\")","v":""},{"$f":"IF(D46<>\"\",VLOOKUP(D46,SIR_NUM,2,FALSE),\"\")","v":""},{"$f":"IF(F46<>\"\",VLOOKUP(F46,SIR_NUM,2,FALSE),\"\")","v":""},{"$f":"IF(H46<>\"\",VLOOKUP(H46,SIR_NUM,2,FALSE),\"\")","v":""}]
[null,null,null,null,null,null,null,null,{"$f":"IF(M47<>\"\",VLOOKUP(M47,NUM_SIR,2, FALSE),\"\")","v":""},"","","",{"$f":"IF(SUM(N47:P47)>0,IF(ISERROR(MODE(N47:P47)),MEDIAN(N47:P47),MODE(N47:P47)),\"\")","v":""},{"$f":"IF(D47<>\"\",VLOOKUP(D47,SIR_NUM,2,FALSE),\"\")","v":""},{"$f":"IF(F47<>\"\",VLOOKUP(F47,SIR_NUM,2,FALSE),\"\")","v":""},{"$f":"IF(H47<>\"\",VLOOKUP(H47,SIR_NUM,2,FALSE),\"\")","v":""},null,0]
[null,null,null,null,null,null,null,null,{"$f":"IF(M48<>\"\",VLOOKUP(M48,NUM_SIR,2, FALSE),\"\")","v":""},"","","",{"$f":"IF(SUM(N48:P48)>0,IF(ISERROR(MODE(N48:P48)),MEDIAN(N48:P48),MODE(N48:P48)),\"\")","v":""},{"$f":"IF(D48<>\"\",VLOOKUP(D48,SIR_NUM,2,FALSE),\"\")","v":""},{"$f":"IF(F48<>\"\",VLOOKUP(F48,SIR_NUM,2,FALSE),\"\")","v":""},{"$f":"IF(H48<>\"\",VLOOKUP(H48,SIR_NUM,2,FALSE),\"\")","v":""}]
[null,null,null,null,null,null,null,null,{"$f":"IF(M49<>\"\",VLOOKUP(M49,NUM_SIR,2, FALSE),\"\")","v":""},"","","",{"$f":"IF(SUM(N49:P49)>0,IF(ISERROR(MODE(N49:P49)),MEDIAN(N49:P49),MODE(N49:P49)),\"\")","v":""},{"$f":"IF(D49<>\"\",VLOOKUP(D49,SIR_NUM,2,FALSE),\"\")","v":""},{"$f":"IF(F49<>\"\",VLOOKUP(F49,SIR_NUM,2,FALSE),\"\")","v":""},{"$f":"IF(H49<>\"\",VLOOKUP(H49,SIR_NUM,2,FALSE),\"\")","v":""}]
[null,null,null,null,null,null,null,null,{"$f":"IF(M50<>\"\",VLOOKUP(M50,NUM_SIR,2, FALSE),\"\")","v":""},"","","",{"$f":"IF(SUM(N50:P50)>0,IF(ISERROR(MODE(N50:P50)),MEDIAN(N50:P50),MODE(N50:P50)),\"\")","v":""},{"$f":"IF(D50<>\"\",VLOOKUP(D50,SIR_NUM,2,FALSE),\"\")","v":""},{"$f":"IF(F50<>\"\",VLOOKUP(F50,SIR_NUM,2,FALSE),\"\")","v":""},{"$f":"IF(H50<>\"\",VLOOKUP(H50,SIR_NUM,2,FALSE),\"\")","v":""}]

{"sheet":"BIT-3","index":7,"n_rows":44,"n_cols":154,"rows_kept":44,"cut":false,"hidden":false,"merged":[[0,124,0,138],[4,124,4,127],[4,129,4,133],[4,134,4,138],[4,99,4,103],[4,104,4,108],[0,109,0,123],[4,109,4,112],[4,114,4,118],[4,119,4,123],[4,79,4,82],[4,84,4,88],[4,89,4,93],[4,94,4,97],[4,69,4,73],[4,74,4,78],[4,64,4,67],[4,24,4,28],[4,29,4,33],[4,34,4,37],[4,2,4,3],[4,4,4,7],[4,9,4,13],[4,14,4,18],[4,19,4,22],[4,39,4,43],[4,44,4,48],[4,49,4,52],[4,54,4,58],[4,59,4,63],[0,49,0,63],[0,64,0,78],[0,79,0,93],[0,94,0,108],[0,4,0,18],[0,19,0,33],[0,34,0,48],[4,0,4,1],[1,0,3,3],[0,0,0,3],[37,9,37,12],[37,24,37,27],[37,129,37,132],[37,114,37,117],[37,54,37,57],[37,39,37,42],[37,99,37,102],[37,84,37,87],[37,69,37,72],[0,139,0,153],[4,139,4,142],[4,144,4,148],[4,149,4,153],[37,144,37,147],[36,139,36,153]]}
["AR Bank PFA Validation Set",null,null,null,"Meropenem Breakpoints 2(S)/4(I)/8(R)",null,null,null,null,null,null,null,null,null,null,null,null,null,null,"Imipenem Breakpoints 2(S)/4(I)/8(R)",null,null,null,null,null,null,null,null,null,null,null,null,null,null,"Aztreonam Breakpoints 8(S)/16(I)/32(R)",null,null,null,null,null,null,null,null,null,null,null,null,null,null,"Cefepime Breakpoints 8(S)/16(I)/32(R)",null,null,null,null,null,null,null,null,null,null,null,null,null,null,"Ceftazidime Breakpoints 8(S)/16(I)/32(R)",null,null,null,null,null,null,null,null,null,null,null,null,null,null,"Ciprofloxacin Breakpoints 0.5(S)/1(I)/2(R)",null,null,null,null,null,null,null,null,null,null,null,null,null,null,"Levofloxacin Breakpoints 1(S)/2(I)/4(R)",null,null,null,null,null,null,null,null,null,null,null,null,null,null,"Piperacillin/tazobactam Breakpoints 16(S)/32(I)/64(R)",null,null,null,null,null,null,null,null,null,null,null,null,null,null,"Tobramycin Breakpoints 1(S)/2(I)/4(R)",null,null,null,null,null,null,null,null,null,null,null,null,null,null,"Colistin Breakpoints 2(I)/4(R)"]
["This set can be used to validate Pseudomonas aeruginosa and the following antimicrobials:  meropenem, imipenem, aztreonam, cefepime, ceftazidime, ciprofloxacin, levofloxacin, piperacillin/tazobactam, tobramycin, colistin",null,null,null,"N 'S'",{"$f":"COUNTIF(H$7:H$36,\"S\")","v":11},null,null,null,null,null,null,null,null,null,null,null,null,null,"N 'S'",{"$f":"COUNTIF(W$7:W$36,\"S\")","v":7},null,null,null,null,null,null,null,null,null,null,null,null,null,"N 'S'",{"$f":"COUNTIF(AL$7:AL$36,\"S\")","v":15},null,null,null,null,null,null,null,null,null,null,null,null,null,"N 'S'",{"$f":"COUNTIF(BA$7:BA$36,\"S\")","v":15},null,null,null,null,null,null,null,null,null,null,null,null,null,"N 'S'",{"$f":"COUNTIF(BP$7:BP$36,\"S\")","v":15},null,null,null,null,null,null,null,null,null,null,null,null,null,"N 'S'",{"$f":"COUNTIF(CE$7:CE$36,\"S\")","v":15},null,null,null,null,null,null,null,null,null,null,null,null,null,"N 'S'",{"$f":"COUNTIF(CT$7:CT$36,\"S\")","v":15},null,null,null,null,null,null,null,null,null,null,null,null,null,"N 'S'",{"$f":"COUNTIF(DI$7:DI$36,\"S\")","v":15},null,null,null,null,null,null,null,null,null,null,null,null,null,"N 'S'",{"$f":"COUNTIF(DX$7:DX$36,\"S\")","v":16},null,null,null,null,null,null,null,null,null,null,null,null,null,"N 'S'",{"$f":"COUNTIF(EM$7:EM$36,\"S\")","v":0}]
[null,null,null,null,"N 'I'",{"$f":"COUNTIF(H$7:H$36,\"I\")","v":4},null,null,null,null,null,null,null,null,null,null,null,null,null,"N 'I'",{"$f":"COUNTIF(W$7:W$36,\"I\")","v":2},null,null,null,null,null,null,null,null,null,null,null,null,null,"N 'I'",{"$f":"COUNTIF(AL$7:AL$36,\"I\")","v":2},null,null,null,null,null,null,null,null,null,null,null,null,null,"N 'I'",{"$f":"COUNTIF(BA$7:BA$36,\"I\")","v":1},null,null,null,null,null,null,null,null,null,null,null,null,null,"N 'I'",{"$f":"COUNTIF(BP$7:BP$36,\"I\")","v":0},null,null,null,null,null,null,null,null,null,null,null,null,null,"N 'I'",{"$f":"COUNTIF(CE$7:CE$36,\"I\")","v":1},null,null,null,null,null,null,null,null,null,null,null,null,null,"N 'I'",{"$f":"COUNTIF(CT$7:CT$36,\"I\")","v":1},null,null,null,null,null,null,null,null,null,null,null,null,null,"N 'I'",{"$f":"COUNTIF(DI$7:DI$36,\"I\")","v":0},null,null,null,null,null,null,null,null,null,null,null,null,null,"N 'I'",{"$f":"COUNTIF(DX$7:DX$36,\"I\")","v":2},null,null,null,null,null,null,null,null,null,null,null,null,null,"N 'I'",{"$f":"COUNTIF(EM$7:EM$36,\"I\")","v":29}]
[null,null,null,null,"N 'R'",{"$f":"COUNTIF(H$7:H$36,\"R\")","v":15},null,null,null,null,null,null,null,null,null,null,null,null,null,"N 'R'",{"$f":"COUNTIF(W$7:W$36,\"R\")","v":21},null,null,null,null,null,null,null,null,null,null,null,null,null,"N 'R'",{"$f":"COUNTIF(AL$7:AL$36,\"R\")","v":13},null,null,null,null,null,null,null,null,null,null,null,null,null,"N 'R'",{"$f":"COUNTIF(BA$7:BA$36,\"R\")","v":14},null,null,null,null,null,null,null,null,null,null,null,null,null,"N 'R'",{"$f":"COUNTIF(BP$7:BP$36,\"R\")","v":15},null,null,null,null,null,null,null,null,null,null,null,null,null,"N 'R'",{"$f":"COUNTIF(CE$7:CE$36,\"R\")","v":14},null,null,null,null,null,null,null,null,null,null,null,null,null,"N 'R'",{"$f":"COUNTIF(CT$7:CT$36,\"R\")","v":14},null,null,null,null,null,null,null,null,null,null,null,null,null,"N 'R'",{"$f":"COUNTIF(DI$7:DI$36,\"R\")","v":15},null,null,null,null,null,null,null,null,null,null,null,null,null,"N 'R'",{"$f":"COUNTIF(DX$7:DX$36,\"R\")","v":12},null,null,null,null,null,null,null,null,null,null,null,null,null,"N 'R'",{"$f":"COUNTIF(EM$7:EM$36,\"R\")","v":1}]
["Lab Information",null,"AR Bank Information",null,"Meropenem AR Bank Data",null,null,null,null," Meropenem Test Data ",null,null,null,null," Meropenem Calculations",null,null,null,null,"Imipenem AR Bank Data",null,null,null,null," Imipenem Test Data ",null,null,null,null,"Imipenem Calculations",null,null,null,null,"Aztreonam AR Bank Data",null,null,null,null," Aztreonam Test Data ",null,null,null,null,"Aztreonam Calculations",null,null,null,null,"Cefepime AR Bank Data",null,null,null,null," Cefepime Test Data ",null,null,null,null,"Cefepime Calculations",null,null,null,null,"Ceftazidime AR Bank Data",null,null,null,null," Ceftazidime Test Data ",null,null,null,null,"Ceftazidime Calculations",null,null,null,null,"Ciprofloxacin AR Bank Data",null,null,null,null," Ciprofloxacin Test Data ",null,null,null,null,"Ciprofloxacin Calculations",null,null,null,null,"Levofloxacin AR Bank Data",null,null,null,null," Levofloxacin Test Data ",null,null,null,null,"Levofloxacin Calculations",null,null,null,null,"Pip/tazo AR Bank Data",null,null,null,null," Pip/tazo Test Data ",null,null,null,null,"Pip/tazo Calculations",null,null,null,null,"Tobramycin AR Bank Data",null,null,null,null," Tobramycin Test Data ",null,null,null,null,"Tobramycin Calculations",null,null,null,null,"Colistin AR Bank Data",null,null,null,null," Colistin Test Data ",null,null,null,null,"Colistin Calculations"]
["Date Tested","Initials of Tester","AR Bank Number","Organism","Sign","MIC","Hidden MIC Result (conservative)","Interp","Hidden MIC Result Logged","Test Sign","Test  MIC","Hidden MIC Result (conservative)","Test Interp","Hidden MIC Result Logged","EA","Hidden Eval","Dilutions","CA","Error","Sign","MIC","Hidden MIC Result (conservative)","Interp","Hidden MIC Result Logged","Test Sign","Test  MIC","Hidden MIC Result (conservative)","Test Interp","Hidden MIC Result Logged","EA","Hidden Eval","Dilutions","CA","Error","Sign","MIC","Hidden MIC Result (conservative)","Interp","Hidden MIC Result Logged","Test Sign","Test  MIC","Hidden MIC Result (conservative)","Test Interp","Hidden MIC Result Logged","EA","Hidden Eval","Dilutions","CA","Error","Sign","MIC","Hidden MIC Result (conservative)","Interp","Hidden MIC Result Logged","Test Sign","Test  MIC","Hidden MIC Result (conservative)","Test Interp","Hidden MIC Result Logged","EA","Hidden Eval","Dilutions","CA","Error","Sign","MIC","Hidden MIC Result (conservative)","Interp","Hidden MIC Result Logged","Test Sign","Test  MIC","Hidden MIC Result (conservative)","Test Interp","Hidden MIC Result Logged","EA","Hidden Eval","Dilutions","CA","Error","Sign","MIC","Hidden MIC Result (conservative)","Interp","Hidden MIC Result Logged","Test Sign","Test  MIC","Hidden MIC Result (conservative)","Test Interp","Hidden MIC Result Logged","EA","Hidden Eval","Dilutions","CA","Error","Sign","MIC","Hidden MIC Result (conservative)","Interp","Hidden MIC Result Logged","Test Sign","Test  MIC","Hidden MIC Result (conservative)","Test Interp","Hidden MIC Result Logged","EA","Hidden Eval","Dilutions","CA","Error","Sign","MIC","Hidden MIC Result (conservative)","Interp","Hidden MIC Result Logged","Test Sign","Test  MIC","Hidden MIC Result (conservative)","Test Interp","Hidden MIC Result Logged","EA","Hidden Eval","Dilutions","CA","Error","Sign","MIC","Hidden MIC Result (conservative)","Interp","Hidden MIC Result Logged","Test Sign","Test  MIC","Hidden MIC Result (conservative)","Test Interp","Hidden MIC Result Logged","EA","Hidden Eval","Dilutions","CA","Error","Sign","MIC","Hidden MIC Result (conservative)","Interp","Hidden MIC Result Logged","Test Sign","Test  MIC","Hidden MIC Result (conservative)","Test Interp","Hidden MIC Result Logged","EA","Hidden Eval","Dilutions","CA","Error"]
[null,null,"AR0229","Pseudomonas aeruginosa",">",8,{"$f":"IF(AND(F7<>\"\"),IF(E7=\">\",F7*2,F7*1),\"\")","v":16},{"$f":"IF((ISNUMBER(G7)),\nIF(G7<=2,\"S\",\nIF(G7=4,\"I\",\nIF(G7>=8,\"R\", \"\"))),\"\")","v":"R"},{"$f":"IF(ISNUMBER(G7),ROUND(IMLOG2(G7),1),\"\")","v":4},null,null,{"$f":"IF(AND(ISNUMBER(K7)),IF(J7=\">\",K7*2,K7),\"\")","v":""},{"$f":"IF((ISNUMBER(L7)),\nIF(L7<=2,\"S\",\nIF(L7=4,\"I\",\nIF(L7>=8,\"R\", \"\"))),\"\")","v":""},{"$f":"IF(ISNUMBER(L7),ROUND(IMLOG2(L7),1),\"\")","v":""},{"$f":"IF(ISNUMBER(L7),IF(AND(E7=\">\",L7>=G7),\"YES\",IF(AND(OR(J7=\">\",J7=\">=\"),G7>L7),\"YES\",IF(AND(E7=\"<=\",L7<G7),\"YES\",IF(AND(J7=\"<=\",G7<L7),\"YES\",IF(ABS(N7-I7)<=1,\"YES\",\"NO\"))))),\"\")","v":""},{"$f":"IF(ISNUMBER(K7),IF(AND(E7=\"<=\",N7<=I7), \"No\", IF(AND(E7=\"<=\", J7=\"<=\"), \"No\", IF(AND(E7=\">\",N7>=I7), \"No\", IF(AND(J7=\"<=\", I7<=N7), \"No\", IF(AND(OR(J7=\">\",J7=\">=\"),I7>=N7), \"No\", \"yes\"))))),\"\")","v":""},{"$f":"IF(ISNUMBER(K7),IF(AND(J7=\"<=\",E7=\"<=\"),0,IF(AND(OR(J7=\">\",J7=\">=\"),E7=\">\"),0,IF(AND(J7=\"<=\",I7<N7),0, IF(AND(E7=\"<=\", N7<I7),0,IF(AND(OR(E7=\">\", E7=\">=\"),N7>I7),0,IF(AND(OR(J7=\">\", J7=\">=\"),I7>N7),0,IF(ISNUMBER(K7),N7-I7,\"\"))))))),\"\")","v":""},{"$f":"IF(M7<>\"\",IF(EXACT(M7,H7),\"YES\",\"NO\"),\"\")","v":""},{"$f":"IF(M7<>\"\", IF(AND(H7=\"I\",OR(M7=\"S\",M7=\"R\")),\"minE\",IF(AND(M7=\"I\",OR(H7=\"S\",H7=\"R\")),\"minE\",IF(AND(H7=\"R\",M7=\"S\"),\"VME\",IF(AND(H7=\"S\",M7=\"R\"),\"ME\",\"\")))),\"\")","v":""},null,32,{"$f":"IF(AND(U7<>\"\"),IF(T7=\">\",U7*2,U7*1),\"\")","v":32},{"$f":"IF((ISNUMBER(V7)),\nIF(V7<=2,\"S\",\nIF(V7=4,\"I\",\nIF(V7>=8,\"R\", \"\"))),\"\")","v":"R"},{"$f":"IF(ISNUMBER(V7),ROUND(IMLOG2(V7),1),\"\")","v":5},null,null,{"$f":"IF(AND(ISNUMBER(Z7)),IF(Y7=\">\",Z7*2,Z7),\"\")","v":""},{"$f":"IF((ISNUMBER(AA7)),\nIF(AA7<=2,\"S\",\nIF(AA7=4,\"I\",\nIF(AA7>=8,\"R\", \"\"))),\"\")","v":""},{"$f":"IF(ISNUMBER(AA7),ROUND(IMLOG2(AA7),1),\"\")","v":""},{"$f":"IF(ISNUMBER(AA7),IF(AND(T7=\">\",AA7>=V7),\"YES\",IF(AND(OR(Y7=\">\",Y7=\">=\"),V7>AA7),\"YES\",IF(AND(T7=\"<=\",AA7<V7),\"YES\",IF(AND(Y7=\"<=\",V7<AA7),\"YES\",IF(ABS(AC7-X7)<=1,\"YES\",\"NO\"))))),\"\")","v":""},{"$f":"IF(ISNUMBER(Z7),IF(AND(T7=\"<=\",AC7<=X7), \"No\", IF(AND(T7=\"<=\", Y7=\"<=\"), \"No\", IF(AND(T7=\">\",AC7>=X7), \"No\", IF(AND(Y7=\"<=\", X7<=AC7), \"No\", IF(AND(OR(Y7=\">\",Y7=\">=\"),X7>=AC7), \"No\", \"yes\"))))),\"\")","v":""},{"$f":"IF(ISNUMBER(Z7),IF(AND(Y7=\"<=\",T7=\"<=\"),0,IF(AND(OR(Y7=\">\",Y7=\">=\"),T7=\">\"),0,IF(AND(Y7=\"<=\",X7<AC7),0, IF(AND(T7=\"<=\", AC7<X7),0,IF(AND(OR(T7=\">\", T7=\">=\"),AC7>X7),0,IF(AND(OR(Y7=\">\", Y7=\">=\"),X7>AC7),0,IF(ISNUMBER(Z7),AC7-X7,\"\"))))))),\"\")","v":""},{"$f":"IF(AB7<>\"\",IF(EXACT(AB7,W7),\"YES\",\"NO\"),\"\")","v":""},{"$f":"IF(AB7<>\"\", IF(AND(W7=\"I\",OR(AB7=\"S\",AB7=\"R\")),\"minE\",IF(AND(AB7=\"I\",OR(W7=\"S\",W7=\"R\")),\"minE\",IF(AND(W7=\"R\",AB7=\"S\"),\"VME\",IF(AND(W7=\"S\",AB7=\"R\"),\"ME\",\"\")))),\"\")","v":""},null,64,{"$f":"IF(AND(AJ7<>\"\"),IF(AI7=\">\",AJ7*2,AJ7*1),\"\")","v":64},{"$f":"IF((ISNUMBER(AK7)),\nIF(AK7<=8,\"S\",\nIF(AK7=16,\"I\",\nIF(AK7>=32,\"R\", \"\"))),\"\")","v":"R"},{"$f":"IF(ISNUMBER(AK7),ROUND(IMLOG2(AK7),1),\"\")","v":6},null,null,{"$f":"IF(AND(ISNUMBER(AO7)),IF(AN7=\">\",AO7*2,AO7),\"\")","v":""},{"$f":"IF((ISNUMBER(AP7)),\nIF(AP7<=8,\"S\",\nIF(AP7=16,\"I\",\nIF(AP7>=32,\"R\", \"\"))),\"\")","v":""},{"$f":"IF(ISNUMBER(AP7),ROUND(IMLOG2(AP7),1),\"\")","v":""},{"$f":"IF(ISNUMBER(AP7),IF(AND(AI7=\">\",AP7>=AK7),\"YES\",IF(AND(OR(AN7=\">\",AN7=\">=\"),AK7>AP7),\"YES\",IF(AND(AI7=\"<=\",AP7<AK7),\"YES\",IF(AND(AN7=\"<=\",AK7<AP7),\"YES\",IF(ABS(AR7-AM7)<=1,\"YES\",\"NO\"))))),\"\")","v":""},{"$f":"IF(ISNUMBER(AO7),IF(AND(AI7=\"<=\",AR7<=AM7), \"No\", IF(AND(AI7=\"<=\", AN7=\"<=\"), \"No\", IF(AND(AI7=\">\",AR7>=AM7), \"No\", IF(AND(AN7=\"<=\", AM7<=AR7), \"No\", IF(AND(OR(AN7=\">\",AN7=\">=\"),AM7>=AR7), \"No\", \"yes\"))))),\"\")","v":""},{"$f":"IF(ISNUMBER(AO7),IF(AND(AN7=\"<=\",AI7=\"<=\"),0,IF(AND(OR(AN7=\">\",AN7=\">=\"),AI7=\">\"),0,IF(AND(AN7=\"<=\",AM7<AR7),0, IF(AND(AI7=\"<=\", AR7<AM7),0,IF(AND(OR(AI7=\">\", AI7=\">=\"),AR7>AM7),0,IF(AND(OR(AN7=\">\", AN7=\">=\"),AM7>AR7),0,IF(ISNUMBER(AO7),AR7-AM7,\"\"))))))),\"\")","v":""},{"$f":"IF(AQ7<>\"\",IF(EXACT(AQ7,AL7),\"YES\",\"NO\"),\"\")","v":""},{"$f":"IF(AQ7<>\"\", IF(AND(AL7=\"I\",OR(AQ7=\"S\",AQ7=\"R\")),\"minE\",IF(AND(AQ7=\"I\",OR(AL7=\"S\",AL7=\"R\")),\"minE\",IF(AND(AL7=\"R\",AQ7=\"S\"),\"VME\",IF(AND(AL7=\"S\",AQ7=\"R\"),\"ME\",\"\")))),\"\")","v":""},null,32,{"$f":"IF(AND(AY7<>\"\"),IF(AX7=\">\",AY7*2,AY7*1),\"\")","v":32},{"$f":"IF((ISNUMBER(AZ7)),\nIF(AZ7<=8,\"S\",\nIF(AZ7=16,\"I\",\nIF(AZ7>=32,\"R\", \"\"))),\"\")","v":"R"},{"$f":"IF(ISNUMBER(AZ7),ROUND(IMLOG2(AZ7),1),\"\")","v":5},null,null,{"$f":"IF(AND(ISNUMBER(BD7)),IF(BC7=\">\",BD7*2,BD7),\"\")","v":""},{"$f":"IF((ISNUMBER(BE7)),\nIF(BE7<=8,\"S\",\nIF(BE7=16,\"I\",\nIF(BE7>=32,\"R\", \"\"))),\"\")","v":""},{"$f":"IF(ISNUMBER(BE7),ROUND(IMLOG2(BE7),1),\"\")","v":""},{"$f":"IF(ISNUMBER(BE7),IF(AND(AX7=\">\",BE7>=AZ7),\"YES\",IF(AND(OR(BC7=\">\",BC7=\">=\"),AZ7>BE7),\"YES\",IF(AND(AX7=\"<=\",BE7<AZ7),\"YES\",IF(AND(BC7=\"<=\",AZ7<BE7),\"YES\",IF(ABS(BG7-BB7)<=1,\"YES\",\"NO\"))))),\"\")","v":""},{"$f":"IF(ISNUMBER(BD7),IF(AND(AX7=\"<=\",BG7<=BB7), \"No\", IF(AND(AX7=\"<=\", BC7=\"<=\"), \"No\", IF(AND(AX7=\">\",BG7>=BB7), \"No\", IF(AND(BC7=\"<=\", BB7<=BG7), \"No\", IF(AND(OR(BC7=\">\",BC7=\">=\"),BB7>=BG7), \"No\", \"yes\"))))),\"\")","v":""},{"$f":"IF(ISNUMBER(BD7),IF(AND(BC7=\"<=\",AX7=\"<=\"),0,IF(AND(OR(BC7=\">\",BC7=\">=\"),AX7=\">\"),0,IF(AND(BC7=\"<=\",BB7<BG7),0, IF(AND(AX7=\"<=\", BG7<BB7),0,IF(AND(OR(AX7=\">\", AX7=\">=\"),BG7>BB7),0,IF(AND(OR(BC7=\">\", BC7=\">=\"),BB7>BG7),0,IF(ISNUMBER(BD7),BG7-BB7,\"\"))))))),\"\")","v":""},{"$f":"IF(BF7<>\"\",IF(EXACT(BF7,BA7),\"YES\",\"NO\"),\"\")","v":""},{"$f":"IF(BF7<>\"\", IF(AND(BA7=\"I\",OR(BF7=\"S\",BF7=\"R\")),\"minE\",IF(AND(BF7=\"I\",OR(BA7=\"S\",BA7=\"R\")),\"minE\",IF(AND(BA7=\"R\",BF7=\"S\"),\"VME\",IF(AND(BA7=\"S\",BF7=\"R\"),\"ME\",\"\")))),\"\")","v":""},null,64,{"$f":"IF(AND(BN7<>\"\"),IF(BM7=\">\",BN7*2,BN7*1),\"\")","v":64},{"$f":"IF((ISNUMBER(BO7)),\nIF(BO7<=8,\"S\",\nIF(BO7=16,\"I\",\nIF(BO7>=32,\"R\", \"\"))),\"\")","v":"R"},{"$f":"IF(ISNUMBER(BO7),ROUND(IMLOG2(BO7),1),\"\")","v":6},null,null,{"$f":"IF(AND(ISNUMBER(BS7)),IF(BR7=\">\",BS7*2,BS7),\"\")","v":""},{"$f":"IF((ISNUMBER(BT7)),\nIF(BT7<=8,\"S\",\nIF(BT7=16,\"I\",\nIF(BT7>=32,\"R\", \"\"))),\"\")","v":""},{"$f":"IF(ISNUMBER(BT7),ROUND(IMLOG2(BT7),1),\"\")","v":""},{"$f":"IF(ISNUMBER(BT7),IF(AND(BM7=\">\",BT7>=BO7),\"YES\",IF(AND(OR(BR7=\">\",BR7=\">=\"),BO7>BT7),\"YES\",IF(AND(BM7=\"<=\",BT7<BO7),\"YES\",IF(AND(BR7=\"<=\",BO7<BT7),\"YES\",IF(ABS(BV7-BQ7)<=1,\"YES\",\"NO\"))))),\"\")","v":""},{"$f":"IF(ISNUMBER(BS7),IF(AND(BM7=\"<=\",BV7<=BQ7), \"No\", IF(AND(BM7=\"<=\", BR7=\"<=\"), \"No\", IF(AND(BM7=\">\",BV7>=BQ7), \"No\", IF(AND(BR7=\"<=\", BQ7<=BV7), \"No\", IF(AND(OR(BR7=\">\",BR7=\">=\"),BQ7>=BV7), \"No\", \"yes\"))))),\"\")","v":""},{"$f":"IF(ISNUMBER(BS7),IF(AND(BR7=\"<=\",BM7=\"<=\"),0,IF(AND(OR(BR7=\">\",BR7=\">=\"),BM7=\">\"),0,IF(AND(BR7=\"<=\",BQ7<BV7),0, IF(AND(BM7=\"<=\", BV7<BQ7),0,IF(AND(OR(BM7=\">\", BM7=\">=\"),BV7>BQ7),0,IF(AND(OR(BR7=\">\", BR7=\">=\"),BQ7>BV7),0,IF(ISNUMBER(BS7),BV7-BQ7,\"\"))))))),\"\")","v":""},{"$f":"IF(BU7<>\"\",IF(EXACT(BU7,BP7),\"YES\",\"NO\"),\"\")","v":""},{"$f":"IF(BU7<>\"\", IF(AND(BP7=\"I\",OR(BU7=\"S\",BU7=\"R\")),\"minE\",IF(AND(BU7=\"I\",OR(BP7=\"S\",BP7=\"R\")),\"minE\",IF(AND(BP7=\"R\",BU7=\"S\"),\"VME\",IF(AND(BP7=\"S\",BU7=\"R\"),\"ME\",\"\")))),\"\")","v":""},">",8,{"$f":"IF(AND(CC7<>\"\"),IF(CB7=\">\",CC7*2,CC7*1),\"\")","v":16},{"$f":"IF((ISNUMBER(CD7)),\nIF(CD7<=0.5,\"S\",\nIF(CD7=1,\"I\",\nIF(CD7>=2,\"R\", \"\"))),\"\")","v":"R"},{"$f":"IF(ISNUMBER(CD7),ROUND(IMLOG2(CD7),1),\"\")","v":4},null,null,{"$f":"IF(AND(ISNUMBER(CH7)),IF(CG7=\">\",CH7*2,CH7),\"\")","v":""},{"$f":"IF((ISNUMBER(CI7)),\nIF(CI7<=0.5,\"S\",\nIF(CI7=1,\"I\",\nIF(CI7>=2,\"R\", \"\"))),\"\")","v":""},{"$f":"IF(ISNUMBER(CI7),ROUND(IMLOG2(CI7),1),\"\")","v":""},{"$f":"IF(ISNUMBER(CI7),IF(AND(CB7=\">\",CI7>=CD7),\"YES\",IF(AND(OR(CG7=\">\",CG7=\">=\"),CD7>CI7),\"YES\",IF(AND(CB7=\"<=\",CI7<CD7),\"YES\",IF(AND(CG7=\"<=\",CD7<CI7),\"YES\",IF(ABS(CK7-CF7)<=1,\"YES\",\"NO\"))))),\"\")","v":""},{"$f":"IF(ISNUMBER(CH7),IF(AND(CB7=\"<=\",CK7<=CF7), \"No\", IF(AND(CB7=\"<=\", CG7=\"<=\"), \"No\", IF(AND(CB7=\">\",CK7>=CF7), \"No\", IF(AND(CG7=\"<=\", CF7<=CK7), \"No\", IF(AND(OR(CG7=\">\",CG7=\">=\"),CF7>=CK7), \"No\", \"yes\"))))),\"\")","v":""},{"$f":"IF(ISNUMBER(CH7),IF(AND(CG7=\"<=\",CB7=\"<=\"),0,IF(AND(OR(CG7=\">\",CG7=\">=\"),CB7=\">\"),0,IF(AND(CG7=\"<=\",CF7<CK7),0, IF(AND(CB7=\"<=\", CK7<CF7),0,IF(AND(OR(CB7=\">\", CB7=\">=\"),CK7>CF7),0,IF(AND(OR(CG7=\">\", CG7=\">=\"),CF7>CK7),0,IF(ISNUMBER(CH7),CK7-CF7,\"\"))))))),\"\")","v":""},{"$f":"IF(CJ7<>\"\",IF(EXACT(CJ7,CE7),\"YES\",\"NO\"),\"\")","v":""},{"$f":"IF(CJ7<>\"\", IF(AND(CE7=\"I\",OR(CJ7=\"S\",CJ7=\"R\")),\"minE\",IF(AND(CJ7=\"I\",OR(CE7=\"S\",CE7=\"R\")),\"minE\",IF(AND(CE7=\"R\",CJ7=\"S\"),\"VME\",IF(AND(CE7=\"S\",CJ7=\"R\"),\"ME\",\"\")))),\"\")","v":""},">",8,{"$f":"IF(AND(CR7<>\"\"),IF(CQ7=\">\",CR7*2,CR7*1),\"\")","v":16},{"$f":"IF((ISNUMBER(CS7)),\nIF(CS7<=1,\"S\",\nIF(CS7=2,\"I\",\nIF(CS7>=4,\"R\", \"\"))),\"\")","v":"R"},{"$f":"IF(ISNUMBER(CS7),ROUND(IMLOG2(CS7),1),\"\")","v":4},null,null,{"$f":"IF(AND(ISNUMBER(CW7)),IF(CV7=\">\",CW7*2,CW7),\"\")","v":""},{"$f":"IF((ISNUMBER(CX7)),\nIF(CX7<=1,\"S\",\nIF(CX7=2,\"I\",\nIF(CX7>=4,\"R\", \"\"))),\"\")","v":""},{"$f":"IF(ISNUMBER(CX7),ROUND(IMLOG2(CX7),1),\"\")","v":""},{"$f":"IF(ISNUMBER(CX7),IF(AND(CQ7=\">\",CX7>=CS7),\"YES\",IF(AND(OR(CV7=\">\",CV7=\">=\"),CS7>CX7),\"YES\",IF(AND(CQ7=\"<=\",CX7<CS7),\"YES\",IF(AND(CV7=\"<=\",CS7<CX7),\"YES\",IF(ABS(CZ7-CU7)<=1,\"YES\",\"NO\"))))),\"\")","v":""},{"$f":"IF(ISNUMBER(CW7),IF(AND(CQ7=\"<=\",CZ7<=CU7), \"No\", IF(AND(CQ7=\"<=\", CV7=\"<=\"), \"No\", IF(AND(CQ7=\">\",CZ7>=CU7), \"No\", IF(AND(CV7=\"<=\", CU7<=CZ7), \"No\", IF(AND(OR(CV7=\">\",CV7=\">=\"),CU7>=CZ7), \"No\", \"yes\"))))),\"\")","v":""},{"$f":"IF(ISNUMBER(CW7),IF(AND(CV7=\"<=\",CQ7=\"<=\"),0,IF(AND(OR(CV7=\">\",CV7=\">=\"),CQ7=\">\"),0,IF(AND(CV7=\"<=\",CU7<CZ7),0, IF(AND(CQ7=\"<=\", CZ7<CU7),0,IF(AND(OR(CQ7=\">\", CQ7=\">=\"),CZ7>CU7),0,IF(AND(OR(CV7=\">\", CV7=\">=\"),CU7>CZ7),0,IF(ISNUMBER(CW7),CZ7-CU7,\"\"))))))),\"\")","v":""},{"$f":"IF(CY7<>\"\",IF(EXACT(CY7,CT7),\"YES\",\"NO\"),\"\")","v":""},{"$f":"IF(CY7<>\"\", IF(AND(CT7=\"I\",OR(CY7=\"S\",CY7=\"R\")),\"minE\",IF(AND(CY7=\"I\",OR(CT7=\"S\",CT7=\"R\")),\"minE\",IF(AND(CT7=\"R\",CY7=\"S\"),\"VME\",IF(AND(CT7=\"S\",CY7=\"R\"),\"ME\",\"\")))),\"\")","v":""},">",128,{"$f":"IF(AND(DG7<>\"\"),IF(DF7=\">\",DG7*2,DG7*1),\"\")","v":256},{"$f":"IF((ISNUMBER(DH7)),\nIF(DH7<=16,\"S\",\nIF(DH7=32,\"I\",\nIF(DH7>=64,\"R\", \"\"))),\"\")","v":"R"},{"$f":"IF(ISNUMBER(DH7),ROUND(IMLOG2(DH7),1),\"\")","v":8},null,null,{"$f":"IF(AND(ISNUMBER(DL7)),IF(DK7=\">\",DL7*2,DL7),\"\")","v":""},{"$f":"IF((ISNUMBER(DM7)),\nIF(DM7<=16,\"S\",\nIF(DM7=32,\"I\",\nIF(DM7>=64,\"R\", \"\"))),\"\")","v":""},{"$f":"IF(ISNUMBER(DM7),ROUND(IMLOG2(DM7),1),\"\")","v":""},{"$f":"IF(ISNUMBER(DM7),IF(AND(DF7=\">\",DM7>=DH7),\"YES\",IF(AND(OR(DK7=\">\",DK7=\">=\"),DH7>DM7),\"YES\",IF(AND(DF7=\"<=\",DM7<DH7),\"YES\",IF(AND(DK7=\"<=\",DH7<DM7),\"YES\",IF(ABS(DO7-DJ7)<=1,\"YES\",\"NO\"))))),\"\")","v":""},{"$f":"IF(ISNUMBER(DL7),IF(AND(DF7=\"<=\",DO7<=DJ7), \"No\", IF(AND(DF7=\"<=\", DK7=\"<=\"), \"No\", IF(AND(DF7=\">\",DO7>=DJ7), \"No\", IF(AND(DK7=\"<=\", DJ7<=DO7), \"No\", IF(AND(OR(DK7=\">\",DK7=\">=\"),DJ7>=DO7), \"No\", \"yes\"))))),\"\")","v":""},{"$f":"IF(ISNUMBER(DL7),IF(AND(DK7=\"<=\",DF7=\"<=\"),0,IF(AND(OR(DK7=\">\",DK7=\">=\"),DF7=\">\"),0,IF(AND(DK7=\"<=\",DJ7<DO7),0, IF(AND(DF7=\"<=\", DO7<DJ7),0,IF(AND(OR(DF7=\">\", DF7=\">=\"),DO7>DJ7),0,IF(AND(OR(DK7=\">\", DK7=\">=\"),DJ7>DO7),0,IF(ISNUMBER(DL7),DO7-DJ7,\"\"))))))),\"\")","v":""},{"$f":"IF(DN7<>\"\",IF(EXACT(DN7,DI7),\"YES\",\"NO\"),\"\")","v":""},{"$f":"IF(DN7<>\"\", IF(AND(DI7=\"I\",OR(DN7=\"S\",DN7=\"R\")),\"minE\",IF(AND(DN7=\"I\",OR(DI7=\"S\",DI7=\"R\")),\"minE\",IF(AND(DI7=\"R\",DN7=\"S\"),\"VME\",IF(AND(DI7=\"S\",DN7=\"R\"),\"ME\",\"\")))),\"\")","v":""},null,2,{"$f":"IF(AND(DV7<>\"\"),IF(DU7=\">\",DV7*2,DV7*1),\"\")","v":2},{"$f":"IF((ISNUMBER(DW7)),\nIF(DW7<=1,\"S\",\nIF(DW7=2,\"I\",\nIF(DW7>=4,\"R\", \"\"))),\"\")","v":"I"},{"$f":"IF(ISNUMBER(DW7),ROUND(IMLOG2(DW7),1),\"\")","v":1},null,null,{"$f":"IF(AND(ISNUMBER(EA7)),IF(DZ7=\">\",EA7*2,EA7),\"\")","v":""},{"$f":"IF((ISNUMBER(EB7)),\nIF(EB7<=1,\"S\",\nIF(EB7=2,\"I\",\nIF(EB7>=4,\"R\", \"\"))),\"\")","v":""},{"$f":"IF(ISNUMBER(EB7),ROUND(IMLOG2(EB7),1),\"\")","v":""},{"$f":"IF(ISNUMBER(EB7),IF(AND(DU7=\">\",EB7>=DW7),\"YES\",IF(AND(OR(DZ7=\">\",DZ7=\">=\"),DW7>EB7),\"YES\",IF(AND(DU7=\"<=\",EB7<DW7),\"YES\",IF(AND(DZ7=\"<=\",DW7<EB7),\"YES\",IF(ABS(ED7-DY7)<=1,\"YES\",\"NO\"))))),\"\")","v":""},{"$f":"IF(ISNUMBER(EA7),IF(AND(DU7=\"<=\",ED7<=DY7), \"No\", IF(AND(DU7=\"<=\", DZ7=\"<=\"), \"No\", IF(AND(DU7=\">\",ED7>=DY7), \"No\", IF(AND(DZ7=\"<=\", DY7<=ED7), \"No\", IF(AND(OR(DZ7=\">\",DZ7=\">=\"),DY7>=ED7), \"No\", \"yes\"))))),\"\")","v":""},{"$f":"IF(ISNUMBER(EA7),IF(AND(DZ7=\"<=\",DU7=\"<=\"),0,IF(AND(OR(DZ7=\">\",DZ7=\">=\"),DU7=\">\"),0,IF(AND(DZ7=\"<=\",DY7<ED7),0, IF(AND(DU7=\"<=\", ED7<DY7),0,IF(AND(OR(DU7=\">\", DU7=\">=\"),ED7>DY7),0,IF(AND(OR(DZ7=\">\", DZ7=\">=\"),DY7>ED7),0,IF(ISNUMBER(EA7),ED7-DY7,\"\"))))))),\"\")","v":""},{"$f":"IF(EC7<>\"\",IF(EXACT(EC7,DX7),\"YES\",\"NO\"),\"\")","v":""},{"$f":"IF(EC7<>\"\", IF(AND(DX7=\"I\",OR(EC7=\"S\",EC7=\"R\")),\"minE\",IF(AND(EC7=\"I\",OR(DX7=\"S\",DX7=\"R\")),\"minE\",IF(AND(DX7=\"R\",EC7=\"S\"),\"VME\",IF(AND(DX7=\"S\",EC7=\"R\"),\"ME\",\"\")))),\"\")","v":""},null,1,{"$f":"IF(AND(EK7<>\"\"),IF(EJ7=\">\",EK7*2,EK7*1),\"\")","v":1},{"$f":"IF((ISNUMBER(EL7)),\nIF(EL7<=2,\"I\",\nIF(EL7>=4,\"R\", \"\")),\"\")","v":"I"},{"$f":"IF(ISNUMBER(EL7),ROUND(IMLOG2(EL7),1),\"\")","v":0},null,null,{"$f":"IF(AND(ISNUMBER(EP7)),IF(EO7=\">\",EP7*2,EP7),\"\")","v":""},{"$f":"IF((ISNUMBER(EQ7)),\nIF(EQ7<=2,\"I\",\nIF(EQ7>=4,\"R\", \"\")),\"\")","v":""},{"$f":"IF(ISNUMBER(EQ7),ROUND(IMLOG2(EQ7),1),\"\")","v":""},{"$f":"IF(ISNUMBER(EQ7),IF(AND(EJ7=\">\",EQ7>=EL7),\"YES\",IF(AND(OR(EO7=\">\",EO7=\">=\"),EL7>EQ7),\"YES\",IF(AND(EJ7=\"<=\",EQ7<EL7),\"YES\",IF(AND(EO7=\"<=\",EL7<EQ7),\"YES\",IF(ABS(ES7-EN7)<=1,\"YES\",\"NO\"))))),\"\")","v":""},{"$f":"IF(ISNUMBER(EP7),IF(AND(EJ7=\"<=\",ES7<=EN7), \"No\", IF(AND(EJ7=\"<=\", EO7=\"<=\"), \"No\", IF(AND(EJ7=\">\",ES7>=EN7), \"No\", IF(AND(EO7=\"<=\", EN7<=ES7), \"No\", IF(AND(OR(EO7=\">\",EO7=\">=\"),EN7>=ES7), \"No\", \"yes\"))))),\"\")","v":""},{"$f":"IF(ISNUMBER(EP7),IF(AND(EO7=\"<=\",EJ7=\"<=\"),0,IF(AND(OR(EO7=\">\",EO7=\">=\"),EJ7=\">\"),0,IF(AND(EO7=\"<=\",EN7<ES7),0, IF(AND(EJ7=\"<=\", ES7<EN7),0,IF(AND(OR(EJ7=\">\", EJ7=\">=\"),ES7>EN7),0,IF(AND(OR(EO7=\">\", EO7=\">=\"),EN7>ES7),0,IF(ISNUMBER(EP7),ES7-EN7,\"\"))))))),\"\")","v":""},{"$f":"IF(ER7<>\"\",IF(EXACT(ER7,EM7),\"YES\",\"NO\"),\"\")","v":""},{"$f":"IF(ER7<>\"\", IF(AND(EM7=\"I\",OR(ER7=\"S\",ER7=\"R\")),\"minE\",IF(AND(ER7=\"I\",OR(EM7=\"S\",EM7=\"R\")),\"minE\",IF(AND(EM7=\"R\",ER7=\"S\"),\"VME\",IF(AND(EM7=\"S\",ER7=\"R\"),\"ME\",\"\")))),\"\")","v":""}]
[null,null,"AR0230","Pseudomonas aeruginosa",">",8,16,{"$f":"IF((ISNUMBER(G8)),\nIF(G8<=2,\"S\",\nIF(G8=4,\"I\",\nIF(G8>=8,\"R\", \"\"))),\"\")","v":"R"},4,null,null,{"$f":"IF(AND(ISNUMBER(K8)),IF(J8=\">\",K8*2,K8),\"\")","v":""},{"$f":"IF((ISNUMBER(L8)),\nIF(L8<=2,\"S\",\nIF(L8=4,\"I\",\nIF(L8>=8,\"R\", \"\"))),\"\")","v":""},"",{"$f":"IF(ISNUMBER(L8),IF(AND(E8=\">\",L8>=G8),\"YES\",IF(AND(OR(J8=\">\",J8=\">=\"),G8>L8),\"YES\",IF(AND(E8=\"<=\",L8<G8),\"YES\",IF(AND(J8=\"<=\",G8<L8),\"YES\",IF(ABS(N8-I8)<=1,\"YES\",\"NO\"))))),\"\")","v":""},"",{"$f":"IF(ISNUMBER(K8),IF(AND(J8=\"<=\",E8=\"<=\"),0,IF(AND(OR(J8=\">\",J8=\">=\"),E8=\">\"),0,IF(AND(J8=\"<=\",I8<N8),0, IF(AND(E8=\"<=\", N8<I8),0,IF(AND(OR(E8=\">\", E8=\">=\"),N8>I8),0,IF(AND(OR(J8=\">\", J8=\">=\"),I8>N8),0,IF(ISNUMBER(K8),N8-I8,\"\"))))))),\"\")","v":""},"","",">",64,128,{"$f":"IF((ISNUMBER(V8)),\nIF(V8<=2,\"S\",\nIF(V8=4,\"I\",\nIF(V8>=8,\"R\", \"\"))),\"\")","v":"R"},7,null,null,{"$f":"IF(AND(ISNUMBER(Z8)),IF(Y8=\">\",Z8*2,Z8),\"\")","v":""},{"$f":"IF((ISNUMBER(AA8)),\nIF(AA8<=2,\"S\",\nIF(AA8=4,\"I\",\nIF(AA8>=8,\"R\", \"\"))),\"\")","v":""},"",{"$f":"IF(ISNUMBER(AA8),IF(AND(T8=\">\",AA8>=V8),\"YES\",IF(AND(OR(Y8=\">\",Y8=\">=\"),V8>AA8),\"YES\",IF(AND(T8=\"<=\",AA8<V8),\"YES\",IF(AND(Y8=\"<=\",V8<AA8),\"YES\",IF(ABS(AC8-X8)<=1,\"YES\",\"NO\"))))),\"\")","v":""},"","","","",null,4,4,{"$f":"IF((ISNUMBER(AK8)),\nIF(AK8<=8,\"S\",\nIF(AK8=16,\"I\",\nIF(AK8>=32,\"R\", \"\"))),\"\")","v":"S"},2,null,null,{"$f":"IF(AND(ISNUMBER(AO8)),IF(AN8=\">\",AO8*2,AO8),\"\")","v":""},{"$f":"IF((ISNUMBER(AP8)),\nIF(AP8<=8,\"S\",\nIF(AP8=16,\"I\",\nIF(AP8>=32,\"R\", \"\"))),\"\")","v":""},"",{"$f":"IF(ISNUMBER(AP8),IF(AND(AI8=\">\",AP8>=AK8),\"YES\",IF(AND(OR(AN8=\">\",AN8=\">=\"),AK8>AP8),\"YES\",IF(AND(AI8=\"<=\",AP8<AK8),\"YES\",IF(AND(AN8=\"<=\",AK8<AP8),\"YES\",IF(ABS(AR8-AM8)<=1,\"YES\",\"NO\"))))),\"\")","v":""},"","","","",">",32,64,{"$f":"IF((ISNUMBER(AZ8)),\nIF(AZ8<=8,\"S\",\nIF(AZ8=16,\"I\",\nIF(AZ8>=32,\"R\", \"\"))),\"\")","v":"R"},6,null,null,{"$f":"IF(AND(ISNUMBER(BD8)),IF(BC8=\">\",BD8*2,BD8),\"\")","v":""},{"$f":"IF((ISNUMBER(BE8)),\nIF(BE8<=8,\"S\",\nIF(BE8=16,\"I\",\nIF(BE8>=32,\"R\", \"\"))),\"\")","v":""},"",{"$f":"IF(ISNUMBER(BE8),IF(AND(AX8=\">\",BE8>=AZ8),\"YES\",IF(AND(OR(BC8=\">\",BC8=\">=\"),AZ8>BE8),\"YES\",IF(AND(AX8=\"<=\",BE8<AZ8),\"YES\",IF(AND(BC8=\"<=\",AZ8<BE8),\"YES\",IF(ABS(BG8-BB8)<=1,\"YES\",\"NO\"))))),\"\")","v":""},"","","","",null,32,32,{"$f":"IF((ISNUMBER(BO8)),\nIF(BO8<=8,\"S\",\nIF(BO8=16,\"I\",\nIF(BO8>=32,\"R\", \"\"))),\"\")","v":"R"},5,null,null,{"$f":"IF(AND(ISNUMBER(BS8)),IF(BR8=\">\",BS8*2,BS8),\"\")","v":""},{"$f":"IF((ISNUMBER(BT8)),\nIF(BT8<=8,\"S\",\nIF(BT8=16,\"I\",\nIF(BT8>=32,\"R\", \"\"))),\"\")","v":""},"",{"$f":"IF(ISNUMBER(BT8),IF(AND(BM8=\">\",BT8>=BO8),\"YES\",IF(AND(OR(BR8=\">\",BR8=\">=\"),BO8>BT8),\"YES\",IF(AND(BM8=\"<=\",BT8<BO8),\"YES\",IF(AND(BR8=\"<=\",BO8<BT8),\"YES\",IF(ABS(BV8-BQ8)<=1,\"YES\",\"NO\"))))),\"\")","v":""},"","","","",">",8,16,{"$f":"IF((ISNUMBER(CD8)),\nIF(CD8<=0.5,\"S\",\nIF(CD8=1,\"I\",\nIF(CD8>=2,\"R\", \"\"))),\"\")","v":"R"},4,null,null,{"$f":"IF(AND(ISNUMBER(CH8)),IF(CG8=\">\",CH8*2,CH8),\"\")","v":""},{"$f":"IF((ISNUMBER(CI8)),\nIF(CI8<=0.5,\"S\",\nIF(CI8=1,\"I\",\nIF(CI8>=2,\"R\", \"\"))),\"\")","v":""},"",{"$f":"IF(ISNUMBER(CI8),IF(AND(CB8=\">\",CI8>=CD8),\"YES\",IF(AND(OR(CG8=\">\",CG8=\">=\"),CD8>CI8),\"YES\",IF(AND(CB8=\"<=\",CI8<CD8),\"YES\",IF(AND(CG8=\"<=\",CD8<CI8),\"YES\",IF(ABS(CK8-CF8)<=1,\"YES\",\"NO\"))))),\"\")","v":""},"","","","",">",8,16,{"$f":"IF((ISNUMBER(CS8)),\nIF(CS8<=1,\"S\",\nIF(CS8=2,\"I\",\nIF(CS8>=4,\"R\", \"\"))),\"\")","v":"R"},4,null,null,{"$f":"IF(AND(ISNUMBER(CW8)),IF(CV8=\">\",CW8*2,CW8),\"\")","v":""},{"$f":"IF((ISNUMBER(CX8)),\nIF(CX8<=1,\"S\",\nIF(CX8=2,\"I\",\nIF(CX8>=4,\"R\", \"\"))),\"\")","v":""},"",{"$f":"IF(ISNUMBER(CX8),IF(AND(CQ8=\">\",CX8>=CS8),\"YES\",IF(AND(OR(CV8=\">\",CV8=\">=\"),CS8>CX8),\"YES\",IF(AND(CQ8=\"<=\",CX8<CS8),\"YES\",IF(AND(CV8=\"<=\",CS8<CX8),\"YES\",IF(ABS(CZ8-CU8)<=1,\"YES\",\"NO\"))))),\"\")","v":""},"","","","",">",128,256,{"$f":"IF((ISNUMBER(DH8)),\nIF(DH8<=16,\"S\",\nIF(DH8=32,\"I\",\nIF(DH8>=64,\"R\", \"\"))),\"\")","v":"R"},8,null,null,{"$f":"IF(AND(ISNUMBER(DL8)),IF(DK8=\">\",DL8*2,DL8),\"\")","v":""},{"$f":"IF((ISNUMBER(DM8)),\nIF(DM8<=16,\"S\",\nIF(DM8=32,\"I\",\nIF(DM8>=64,\"R\", \"\"))),\"\")","v":""},"",{"$f":"IF(ISNUMBER(DM8),IF(AND(DF8=\">\",DM8>=DH8),\"YES\",IF(AND(OR(DK8=\">\",DK8=\">=\"),DH8>DM8),\"YES\",IF(AND(DF8=\"<=\",DM8<DH8),\"YES\",IF(AND(DK8=\"<=\",DH8<DM8),\"YES\",IF(ABS(DO8-DJ8)<=1,\"YES\",\"NO\"))))),\"\")","v":""},"","","","",">",16,32,{"$f":"IF((ISNUMBER(DW8)),\nIF(DW8<=1,\"S\",\nIF(DW8=2,\"I\",\nIF(DW8>=4,\"R\", \"\"))),\"\")","v":"R"},5,null,null,{"$f":"IF(AND(ISNUMBER(EA8)),IF(DZ8=\">\",EA8*2,EA8),\"\")","v":""},{"$f":"IF((ISNUMBER(EB8)),\nIF(EB8<=1,\"S\",\nIF(EB8=2,\"I\",\nIF(EB8>=4,\"R\", \"\"))),\"\")","v":""},"",{"$f":"IF(ISNUMBER(EB8),IF(AND(DU8=\">\",EB8>=DW8),\"YES\",IF(AND(OR(DZ8=\">\",DZ8=\">=\"),DW8>EB8),\"YES\",IF(AND(DU8=\"<=\",EB8<DW8),\"YES\",IF(AND(DZ8=\"<=\",DW8<EB8),\"YES\",IF(ABS(ED8-DY8)<=1,\"YES\",\"NO\"))))),\"\")","v":""},"","","","",null,1,1,{"$f":"IF((ISNUMBER(EL8)),\nIF(EL8<=2,\"I\",\nIF(EL8>=4,\"R\", \"\")),\"\")","v":"I"},0,null,null,{"$f":"IF(AND(ISNUMBER(EP8)),IF(EO8=\">\",EP8*2,EP8),\"\")","v":""},{"$f":"IF((ISNUMBER(EQ8)),\nIF(EQ8<=2,\"I\",\nIF(EQ8>=4,\"R\", \"\")),\"\")","v":""},"",{"$f":"IF(ISNUMBER(EQ8),IF(AND(EJ8=\">\",EQ8>=EL8),\"YES\",IF(AND(OR(EO8=\">\",EO8=\">=\"),EL8>EQ8),\"YES\",IF(AND(EJ8=\"<=\",EQ8<EL8),\"YES\",IF(AND(EO8=\"<=\",EL8<EQ8),\"YES\",IF(ABS(ES8-EN8)<=1,\"YES\",\"NO\"))))),\"\")","v":""},"","","",""]
[null,null,"AR0232","Pseudomonas aeruginosa",null,4,4,"I",2,null,null,"","","","","","","","",null,8,8,"R",3,null,null,"","","","","","","","",null,4,4,"S",2,null,null,"","","","","","","","",null,8,8,"S",3,null,null,"","","","","","","","","<=",2,2,"S",1,null,null,"","","","","","","","",null,4,4,"R",2,null,null,"","","","","","","","",null,8,8,"R",3,null,null,"","","","","","","","","<=",4,4,"S",2,null,null,"","","","","","","","",">",16,32,"R",5,null,null,"","","","","","","","",null,1,1,"I",0,null,null,"","","","","","","",""]
[null,null,"AR0234","Pseudomonas aeruginosa",null,2,2,"S",1,null,null,"","","","","","","","",null,8,8,"R",3,null,null,"","","","","","","","","<=",2,2,"S",1,null,null,"","","","","","","","",null,4,4,"S",2,null,null,"","","","","","","","","<=",2,2,"S",1,null,null,"","","","","","","","",null,4,4,"R",2,null,null,"","","","","","","","",null,8,8,"R",3,null,null,"","","","","","","","","<=",4,4,"S",2,null,null,"","","","","","","","",">",16,32,"R",5,null,null,"","","","","","","","",null,1,1,"I",0,null,null,"","","","","","","",""]
[null,null,"AR0237","Pseudomonas aeruginosa",null,2,2,"S",1,null,null,"","","","","","","","",null,8,8,"R",3,null,null,"","","","","","","","",null,4,4,"S",2,null,null,"","","","","","","","","<=",1,1,"S",0,null,null,"","","","","","","","","<=",2,2,"S",1,null,null,"","","","","","","","","<=",0.25,0.25,"S",-2,null,null,"","","","","","","","","<=",0.25,0.25,"S",-2,null,null,"","","","","","","","","<=",4,4,"S",2,null,null,"","","","","","","","","<=",0.5,0.5,"S",-1,null,null,"","","","","","","","",null,1,1,"I",0,null,null,"","","","","","","",""]
[null,null,"AR0238","Pseudomonas aeruginosa","<=",0.25,0.25,"S",-2,null,null,"","","","","","","","","<=",0.5,0.5,"S",-1,null,null,"","","","","","","","",null,8,8,"S",3,null,null,"","","","","","","","",null,4,4,"S",2,null,null,"","","","","","","","",null,2,2,"S",1,null,null,"","","","","","","","","<=",0.25,0.25,"S",-2,null,null,"","","","","","","","",null,0.5,0.5,"S",-1,null,null,"","","","","","","","",null,8,8,"S",3,null,null,"","","","","","","","","<=",0.5,0.5,"S",-1,null,null,"","","","","","","","",null,2,2,"I",1,null,null,"","","","","","","",""]
[null,null,"AR0239","Pseudomonas aeruginosa",">",8,16,"R",4,null,null,"","","","","","","","",">",64,128,"R",7,null,null,"","","","","","","","",null,32,32,"R",5,null,null,"","","","","","","","",">",32,64,"R",6,null,null,"","","","","","","","",">",64,128,"R",7,null,null,"","","","","","","","",">",8,16,"R",4,null,null,"","","","","","","","",">",8,16,"R",4,null,null,"","","","","","","","",">",128,256,"R",8,null,null,"","","","","","","","",">",16,32,"R",5,null,null,"","","","","","","","",null,8,8,"R",3,null,null,"","","","","","","",""]
[null,null,"AR0245","Pseudomonas aeruginosa",null,8,8,"R",3,null,null,"","","","","","","","",null,16,16,"R",4,null,null,"","","","","","","","",null,32,32,"R",5,null,null,"","","","","","","","",null,32,32,"R",5,null,null,"","","","","","","","",null,32,32,"R",5,null,null,"","","","","","","","",">",8,16,"R",4,null,null,"","","","","","","","",">",8,16,"R",4,null,null,"","","","","","","","",null,64,64,"R",6,null,null,"","","","","","","","",">",16,32,"R",5,null,null,"","","","","","","","",null,1,1,"I",0,null,null,"","","","","","","",""]
[null,null,"AR0246","Pseudomonas aeruginosa",">",8,16,"R",4,null,null,"","","","","","","","",">",64,128,"R",7,null,null,"","","","","","","","",">",64,128,"R",7,null,null,"","","","","","","","",">",32,64,"R",6,null,null,"","","","","","","","",">",64,128,"R",7,null,null,"","","","","","","","",">",8,16,"R",4,null,null,"","","","","","","","",">",8,16,"R",4,null,null,"","","","","","","","",">",128,256,"R",8,null,null,"","","","","","","","",">",16,32,"R",5,null,null,"","","","","","","","",null,1,1,"I",0,null,null,"","","","","","","",""]
[null,null,"AR0247","Pseudomonas aeruginosa",null,2,2,"S",1,null,null,"","","","","","","","",null,16,16,"R",4,null,null,"","","","","","","","",null,8,8,"S",3,null,null,"","","","","","","","",null,8,8,"S",3,null,null,"","","","","","","","",null,4,4,"S",2,null,null,"","","","","","","","","<=",0.25,0.25,"S",-2,null,null,"","","","","","","","",null,1,1,"S",0,null,null,"","","","","","","","",null,8,8,"S",3,null,null,"","","","","","","","","<=",0.5,0.5,"S",-1,null,null,"","","","","","","","",null,1,1,"I",0,null,null,"","","","","","","",""]
[null,null,"AR0255","Pseudomonas aeruginosa",">",8,16,"R",4,null,null,"","","","","","","","",">",64,128,"R",7,null,null,"","","","","","","","",null,16,16,"I",4,null,null,"","","","","","","","",">",32,64,"R",6,null,null,"","","","","","","","",null,32,32,"R",5,null,null,"","","","","","","","",">",8,16,"R",4,null,null,"","","","","","","","",">",8,16,"R",4,null,null,"","","","","","","","",">",128,256,"R",8,null,null,"","","","","","","","",">",16,32,"R",5,null,null,"","","","","","","","",null,1,1,"I",0,null,null,"","","","","","","",""]
[null,null,"AR0256","Pseudomonas aeruginosa",null,4,4,"I",2,null,null,"","","","","","","","",null,8,8,"R",3,null,null,"","","","","","","","",null,8,8,"S",3,null,null,"","","","","","","","",null,2,2,"S",1,null,null,"","","","","","","","",null,4,4,"S",2,null,null,"","","","","","","","","<=",0.25,0.25,"S",-2,null,null,"","","","","","","","",null,0.5,0.5,"S",-1,null,null,"","","","","","","","",null,8,8,"S",3,null,null,"","","","","","","","","<=",0.5,0.5,"S",-1,null,null,"","","","","","","","",null,1,1,"I",0,null,null,"","","","","","","",""]
[null,null,"AR0258","Pseudomonas aeruginosa","<=",0.25,0.25,"S",-2,null,null,"","","","","","","","",null,2,2,"S",1,null,null,"","","","","","","","",null,8,8,"S",3,null,null,"","","","","",{"$f":"IF(ISNUMBER(AO19),IF(AND(AN19=\"<=\",AI19=\"<=\"),0,IF(AND(OR(AN19=\">\",AN19=\">=\"),AI19=\">\"),0,IF(AND(AN19=\"<=\",AM19<AR19),0, IF(AND(AI19=\"<=\", AR19<AM19),0,IF(AND(OR(AI19=\">\", AI19=\">=\"),AR19>AM19),0,IF(AND(OR(AN19=\">\", AN19=\">=\"),AM19>AR19),0,IF(ISNUMBER(AO19),AR19-AM19,\"\"))))))),\"\")","v":""},"","",null,2,2,"S",1,null,null,"","","","","",{"$f":"IF(ISNUMBER(BD19),IF(AND(BC19=\"<=\",AX19=\"<=\"),0,IF(AND(OR(BC19=\">\",BC19=\">=\"),AX19=\">\"),0,IF(AND(BC19=\"<=\",BB19<BG19),0, IF(AND(AX19=\"<=\", BG19<BB19),0,IF(AND(OR(AX19=\">\", AX19=\">=\"),BG19>BB19),0,IF(AND(OR(BC19=\">\", BC19=\">=\"),BB19>BG19),0,IF(ISNUMBER(BD19),BG19-BB19,\"\"))))))),\"\")","v":""},"","","<=",2,2,"S",1,null,null,"","","","","",{"$f":"IF(ISNUMBER(BS19),IF(AND(BR19=\"<=\",BM19=\"<=\"),0,IF(AND(OR(BR19=\">\",BR19=\">=\"),BM19=\">\"),0,IF(AND(BR19=\"<=\",BQ19<BV19),0, IF(AND(BM19=\"<=\", BV19<BQ19),0,IF(AND(OR(BM19=\">\", BM19=\">=\"),BV19>BQ19),0,IF(AND(OR(BR19=\">\", BR19=\">=\"),BQ19>BV19),0,IF(ISNUMBER(BS19),BV19-BQ19,\"\"))))))),\"\")","v":""},"","","<=",0.25,0.25,"S",-2,null,null,"","","","","",{"$f":"IF(ISNUMBER(CH19),IF(AND(CG19=\"<=\",CB19=\"<=\"),0,IF(AND(OR(CG19=\">\",CG19=\">=\"),CB19=\">\"),0,IF(AND(CG19=\"<=\",CF19<CK19),0, IF(AND(CB19=\"<=\", CK19<CF19),0,IF(AND(OR(CB19=\">\", CB19=\">=\"),CK19>CF19),0,IF(AND(OR(CG19=\">\", CG19=\">=\"),CF19>CK19),0,IF(ISNUMBER(CH19),CK19-CF19,\"\"))))))),\"\")","v":""},"","",null,0.5,0.5,"S",-1,null,null,"","","","","",{"$f":"IF(ISNUMBER(CW19),IF(AND(CV19=\"<=\",CQ19=\"<=\"),0,IF(AND(OR(CV19=\">\",CV19=\">=\"),CQ19=\">\"),0,IF(AND(CV19=\"<=\",CU19<CZ19),0, IF(AND(CQ19=\"<=\", CZ19<CU19),0,IF(AND(OR(CQ19=\">\", CQ19=\">=\"),CZ19>CU19),0,IF(AND(OR(CV19=\">\", CV19=\">=\"),CU19>CZ19),0,IF(ISNUMBER(CW19),CZ19-CU19,\"\"))))))),\"\")","v":""},"","","<=",4,4,"S",2,null,null,"","","","","",{"$f":"IF(ISNUMBER(DL19),IF(AND(DK19=\"<=\",DF19=\"<=\"),0,IF(AND(OR(DK19=\">\",DK19=\">=\"),DF19=\">\"),0,IF(AND(DK19=\"<=\",DJ19<DO19),0, IF(AND(DF19=\"<=\", DO19<DJ19),0,IF(AND(OR(DF19=\">\", DF19=\">=\"),DO19>DJ19),0,IF(AND(OR(DK19=\">\", DK19=\">=\"),DJ19>DO19),0,IF(ISNUMBER(DL19),DO19-DJ19,\"\"))))))),\"\")","v":""},"","","<=",0.5,0.5,"S",-1,null,null,"","","","","",{"$f":"IF(ISNUMBER(EA19),IF(AND(DZ19=\"<=\",DU19=\"<=\"),0,IF(AND(OR(DZ19=\">\",DZ19=\">=\"),DU19=\">\"),0,IF(AND(DZ19=\"<=\",DY19<ED19),0, IF(AND(DU19=\"<=\", ED19<DY19),0,IF(AND(OR(DU19=\">\", DU19=\">=\"),ED19>DY19),0,IF(AND(OR(DZ19=\">\", DZ19=\">=\"),DY19>ED19),0,IF(ISNUMBER(EA19),ED19-DY19,\"\"))))))),\"\")","v":""},"","",null,1,1,"I",0,null,null,"","","","","",{"$f":"IF(ISNUMBER(EP19),IF(AND(EO19=\"<=\",EJ19=\"<=\"),0,IF(AND(OR(EO19=\">\",EO19=\">=\"),EJ19=\">\"),0,IF(AND(EO19=\"<=\",EN19<ES19),0, IF(AND(EJ19=\"<=\", ES19<EN19),0,IF(AND(OR(EJ19=\">\", EJ19=\">=\"),ES19>EN19),0,IF(AND(OR(EO19=\">\", EO19=\">=\"),EN19>ES19),0,IF(ISNUMBER(EP19),ES19-EN19,\"\"))))))),\"\")","v":""},"",""]
[null,null,"AR0259","Pseudomonas aeruginosa",null,0.5,0.5,"S",-1,null,null,"","","","","","","","",null,2,2,"S",1,null,null,"","","","","","","","",null,4,4,"S",2,null,null,"","","","","","","","","<=",1,1,"S",0,null,null,"","","","","",{"$f":"IF(ISNUMBER(BD20),IF(AND(BC20=\"<=\",AX20=\"<=\"),0,IF(AND(OR(BC20=\">\",BC20=\">=\"),AX20=\">\"),0,IF(AND(BC20=\"<=\",BB20<BG20),0, IF(AND(AX20=\"<=\", BG20<BB20),0,IF(AND(OR(AX20=\">\", AX20=\">=\"),BG20>BB20),0,IF(AND(OR(BC20=\">\", BC20=\">=\"),BB20>BG20),0,IF(ISNUMBER(BD20),BG20-BB20,\"\"))))))),\"\")","v":""},"","","<=",2,2,"S",1,null,null,"","","","","",{"$f":"IF(ISNUMBER(BS20),IF(AND(BR20=\"<=\",BM20=\"<=\"),0,IF(AND(OR(BR20=\">\",BR20=\">=\"),BM20=\">\"),0,IF(AND(BR20=\"<=\",BQ20<BV20),0, IF(AND(BM20=\"<=\", BV20<BQ20),0,IF(AND(OR(BM20=\">\", BM20=\">=\"),BV20>BQ20),0,IF(AND(OR(BR20=\">\", BR20=\">=\"),BQ20>BV20),0,IF(ISNUMBER(BS20),BV20-BQ20,\"\"))))))),\"\")","v":""},"","","<=",0.25,0.25,"S",-2,null,null,"","","","","",{"$f":"IF(ISNUMBER(CH20),IF(AND(CG20=\"<=\",CB20=\"<=\"),0,IF(AND(OR(CG20=\">\",CG20=\">=\"),CB20=\">\"),0,IF(AND(CG20=\"<=\",CF20<CK20),0, IF(AND(CB20=\"<=\", CK20<CF20),0,IF(AND(OR(CB20=\">\", CB20=\">=\"),CK20>CF20),0,IF(AND(OR(CG20=\">\", CG20=\">=\"),CF20>CK20),0,IF(ISNUMBER(CH20),CK20-CF20,\"\"))))))),\"\")","v":""},"","",null,0.5,0.5,"S",-1,null,null,"","","","","",{"$f":"IF(ISNUMBER(CW20),IF(AND(CV20=\"<=\",CQ20=\"<=\"),0,IF(AND(OR(CV20=\">\",CV20=\">=\"),CQ20=\">\"),0,IF(AND(CV20=\"<=\",CU20<CZ20),0, IF(AND(CQ20=\"<=\", CZ20<CU20),0,IF(AND(OR(CQ20=\">\", CQ20=\">=\"),CZ20>CU20),0,IF(AND(OR(CV20=\">\", CV20=\">=\"),CU20>CZ20),0,IF(ISNUMBER(CW20),CZ20-CU20,\"\"))))))),\"\")","v":""},"","","<=",4,4,"S",2,null,null,"","","","","",{"$f":"IF(ISNUMBER(DL20),IF(AND(DK20=\"<=\",DF20=\"<=\"),0,IF(AND(OR(DK20=\">\",DK20=\">=\"),DF20=\">\"),0,IF(AND(DK20=\"<=\",DJ20<DO20),0, IF(AND(DF20=\"<=\", DO20<DJ20),0,IF(AND(OR(DF20=\">\", DF20=\">=\"),DO20>DJ20),0,IF(AND(OR(DK20=\">\", DK20=\">=\"),DJ20>DO20),0,IF(ISNUMBER(DL20),DO20-DJ20,\"\"))))))),\"\")","v":""},"","","<=",0.5,0.5,"S",-1,null,null,"","","","","",{"$f":"IF(ISNUMBER(EA20),IF(AND(DZ20=\"<=\",DU20=\"<=\"),0,IF(AND(OR(DZ20=\">\",DZ20=\">=\"),DU20=\">\"),0,IF(AND(DZ20=\"<=\",DY20<ED20),0, IF(AND(DU20=\"<=\", ED20<DY20),0,IF(AND(OR(DU20=\">\", DU20=\">=\"),ED20>DY20),0,IF(AND(OR(DZ20=\">\", DZ20=\">=\"),DY20>ED20),0,IF(ISNUMBER(EA20),ED20-DY20,\"\"))))))),\"\")","v":""},"","",null,1,1,"I",0,null,null,"","","","","",{"$f":"IF(ISNUMBER(EP20),IF(AND(EO20=\"<=\",EJ20=\"<=\"),0,IF(AND(OR(EO20=\">\",EO20=\">=\"),EJ20=\">\"),0,IF(AND(EO20=\"<=\",EN20<ES20),0, IF(AND(EJ20=\"<=\", ES20<EN20),0,IF(AND(OR(EJ20=\">\", EJ20=\">=\"),ES20>EN20),0,IF(AND(OR(EO20=\">\", EO20=\">=\"),EN20>ES20),0,IF(ISNUMBER(EP20),ES20-EN20,\"\"))))))),\"\")","v":""},"",""]
[null,null,"AR0261","Pseudomonas aeruginosa",null,0.5,0.5,"S",-1,null,null,"","","","","","","","",null,1,1,"S",0,null,null,"","","","","","","","",null,8,8,"S",3,null,null,"","","","","","","","",null,8,8,"S",3,null,null,"","","","","","","","",null,4,4,"S",2,null,null,"","","","","","","","",null,4,4,"R",2,null,null,"","","","","","","","",null,8,8,"R",3,null,null,"","","","","","","","",null,8,8,"S",3,null,null,"","","","","","","","",null,2,2,"I",1,null,null,"","","","","","","","",null,1,1,"I",0,null,null,"","","","","","","",""]
[null,null,"AR0268","Pseudomonas aeruginosa",null,8,8,"R",3,null,null,"","","","","","","","",null,32,32,"R",5,null,null,"","","","","","","","",null,32,32,"R",5,null,null,"","","","","","","","",null,32,32,"R",5,null,null,"","","","","","","","",null,64,64,"R",6,null,null,"","","","","","","","",null,4,4,"R",2,null,null,"","","","","","","","",null,8,8,"R",3,null,null,"","","","","","","","",">",128,256,"R",8,null,null,"","","","","","","","","<=",0.5,0.5,"S",-1,null,null,"","","","","","","","",null,1,1,"I",0,null,null,"","","","","","","",""]
[null,null,"AR0351","Pseudomonas aeruginosa",">",8,16,"R",4,null,null,"","","","","","","","",null,16,16,"R",4,null,null,"","","","","","","","",">",64,128,"R",7,null,null,"","","","","","","","",">",32,64,"R",6,null,null,"","","","","","","","",null,32,32,"R",5,null,null,"","","","","","","","",null,2,2,"R",1,null,null,"","","","","","","","",null,8,8,"R",3,null,null,"","","","","","","","",null,128,128,"R",7,null,null,"","","","","","","","",null,16,16,"R",4,null,null,"","","","","","","","",null,0.5,0.5,"I",-1,null,null,"","","","","","","",""]
[null,null,"AR0354","Pseudomonas aeruginosa",null,4,4,"I",2,null,null,"","","","","","","","",null,8,8,"R",3,null,null,"","","","","","","","",null,32,32,"R",5,null,null,"","","","","","","","",null,32,32,"R",5,null,null,"","","","","","","","",null,32,32,"R",5,null,null,"","","","","","","","",null,4,4,"R",2,null,null,"","","","","","","","",null,8,8,"R",3,null,null,"","","","","","","","",">",128,256,"R",8,null,null,"","","","","","","","",">",16,32,"R",5,null,null,"","","","","","","","",null,1,1,"I",0,null,null,"","","","","","","",""]
[null,null,"AR0356","Pseudomonas aeruginosa",">",8,16,"R",4,null,null,"","","","","","","","",">",64,128,"R",7,null,null,"","","","","","","","",">",64,128,"R",7,null,null,"","","","","","","","",">",32,64,"R",6,null,null,"","","","","","","","",null,64,64,"R",6,null,null,"","","","","","","","","<=",0.25,0.25,"S",-2,null,null,"","","","","","","","",null,0.5,0.5,"S",-1,null,null,"","","","","","","","",">",128,256,"R",8,null,null,"","","","","","","","",null,16,16,"R",4,null,null,"","","","","","","","",null,0.5,0.5,"I",-1,null,null,"","","","","","","",""]
[null,null,"AR0358","Pseudomonas aeruginosa",">",8,16,"R",4,null,null,"","","","","","","","",null,32,32,"R",5,null,null,"","","","","","","","",">",64,128,"R",7,null,null,"","","","","","","","",null,32,32,"R",5,null,null,"","","","","","","","",">",128,256,"R",8,null,null,"","","","","","","","",null,1,1,"I",0,null,null,"","","","","","","","",null,2,2,"I",1,null,null,"","","","","","","","",">",128,256,"R",8,null,null,"","","","","","","","",null,16,16,"R",4,null,null,"","","","","","","","","<=",0.25,0.25,"I",-2,null,null,"","","","","","","",""]
[null,null,"AR0360","Pseudomonas aeruginosa",null,8,8,"R",3,null,null,"","","","","","","","",null,16,16,"R",4,null,null,"","","","","","","","",null,32,32,"R",5,null,null,"","","","","","","","",null,16,16,"I",4,null,null,"","","","","","","","",null,64,64,"R",6,null,null,"","","","","","","","",null,0.5,0.5,"S",-1,null,null,"","","","","","","","",null,0.5,0.5,"S",-1,null,null,"","","","","","","","",">",128,256,"R",8,null,null,"","","","","","","","",null,1,1,"S",0,null,null,"","","","","","","","",null,0.5,0.5,"I",-1,null,null,"","","","","","","",""]
[null,null,"AR0447","Pseudomonas aeruginosa",null,2,2,"S",1,null,null,"","","","","","","","",null,4,4,"I",2,null,null,"","","","","","","","",null,4,4,"S",2,null,null,"","","","","","","","",null,2,2,"S",1,null,null,"","","","","","","","",null,2,2,"S",1,null,null,"","","","","","","","","<=",0.25,0.25,"S",-2,null,null,"","","","","","","","",null,0.5,0.5,"S",-1,null,null,"","","","","","","","","<=",4,4,"S",2,null,null,"","","","","","","","",null,1,1,"S",0,null,null,"","","","","","","","",null,1,1,"I",0,null,null,"","","","","","","",""]
[null,null,"AR0459","Pseudomonas aeruginosa",">",8,16,"R",4,null,null,"","","","","","","","",null,32,32,"R",5,null,null,"","","","","","","","",null,64,64,"R",6,null,null,"","","","","","","","",null,32,32,"R",5,null,null,"","","","","","","","",null,64,64,"R",6,null,null,"","","","","","","","",null,4,4,"R",2,null,null,"","","","","","","","",">",8,16,"R",4,null,null,"","","","","","","","",">",128,256,"R",8,null,null,"","","","","","","","",null,1,1,"S",0,null,null,"","","","","","","","",null,1,1,"I",0,null,null,"","","","","","","",""]
[null,null,"AR0511","Pseudomonas aeruginosa",null,8,8,"R",3,null,null,"","","","","","","","",null,16,16,"R",4,null,null,"","","","","","","","","<=",2,2,"S",1,null,null,"","","","","","","","",null,2,2,"S",1,null,null,"","","","","","","","",null,2,2,"S",1,null,null,"","","","","","","","","<=",0.25,0.25,"S",-2,null,null,"","","","","","","","",null,0.5,0.5,"S",-1,null,null,"","","","","","","","",null,8,8,"S",3,null,null,"","","","","","","","","<=",0.5,0.5,"S",-1,null,null,"","","","","","","","",null,1,1,"I",0,null,null,"","","","","","","",""]
[null,null,"AR0514","Pseudomonas aeruginosa",null,4,4,"I",2,null,null,"","","","","","","","",null,16,16,"R",4,null,null,"","","","","","","","",null,16,16,"I",4,null,null,"","","","","","","","",null,2,2,"S",1,null,null,"","","","","","","","",null,2,2,"S",1,null,null,"","","","","","","","","<=",0.25,0.25,"S",-2,null,null,"","","","","","","","",null,0.5,0.5,"S",-1,null,null,"","","","","","","","",null,8,8,"S",3,null,null,"","","","","","","","","<=",0.5,0.5,"S",-1,null,null,"","","","","","","","",null,1,1,"I",0,null,null,"","","","","","","",""]
[null,null,"AR0516","Pseudomonas aeruginosa",">",8,16,"R",4,null,null,"","","","","","","","",null,64,64,"R",6,null,null,"","","","","","","","",">",64,128,"R",7,null,null,"","","","","","","","",">",32,64,"R",6,null,null,"","","","","","","","",null,128,128,"R",7,null,null,"","","","","","","","","<=",0.25,0.25,"S",-2,null,null,"","","","","","","","",null,0.5,0.5,"S",-1,null,null,"","","","","","","","",">",128,256,"R",8,null,null,"","","","","","","","","<=",0.5,0.5,"S",-1,null,null,"","","","","","","","",null,1,1,"I",0,null,null,"","","","","","","",""]
[null,null,"AR0661","Pseudomonas aeruginosa","<=",0.125,0.125,"S",-3,null,null,"","","","","","","","",null,1,1,"S",0,null,null,"","","","","","","","",null,8,8,"S",3,null,null,"","","","","","","","",null,2,2,"S",1,null,null,"","","","","","","","",null,2,2,"S",1,null,null,"","","","","","","","","<=",0.25,0.25,"S",-2,null,null,"","","","","","","","",null,0.5,0.5,"S",-1,null,null,"","","","","","","","",null,8,8,"S",3,null,null,"","","","","","","","","<=",0.5,0.5,"S",-1,null,null,"","","","","","","","",null,2,2,"I",1,null,null,"","","","","","","",""]
[null,null,"AR0663","Pseudomonas aeruginosa","<=",0.125,0.125,"S",-3,null,null,"","","","","","","","",null,1,1,"S",0,null,null,"","","","","","","","",null,8,8,"S",3,null,null,"","","","","","","","",null,2,2,"S",1,null,null,"","","","","","","","",null,2,2,"S",1,null,null,"","","","","","","","","<=",0.25,0.25,"S",-2,null,null,"","","","","","","","",null,0.5,0.5,"S",-1,null,null,"","","","","","","","","<=",4,4,"S",2,null,null,"","","","","","","","","<=",0.5,0.5,"S",-1,null,null,"","","","","","","","",null,2,2,"I",1,null,null,"","","","","","","",""]
[null,null,"AR0664","Pseudomonas aeruginosa","<=",0.125,0.125,"S",-3,null,null,"","","","","","","","",null,1,1,"S",0,null,null,"","","","","","","","",null,8,8,"S",3,null,null,"","","","","","","","",null,4,4,"S",2,null,null,"","","","","","","","",null,8,8,"S",3,null,null,"","","","","","","","",null,0.5,0.5,"S",-1,null,null,"","","","","","","","",null,0.5,0.5,"S",-1,null,null,"","","","","","","","",null,8,8,"S",3,null,null,"","","","","","","","","<=",0.5,0.5,"S",-1,null,null,"","","","","","","","",null,1,1,"I",0,null,null,"","","","","","","",""]
[null,null,"AR0772","Pseudomonas aeruginosa",">",8,16,"R",4,null,null,"","","","","","","","",null,4,4,{"$f":"IF((ISNUMBER(V36)),\nIF(V36<=2,\"S\",\nIF(V36=4,\"I\",\nIF(V36>=8,\"R\", \"\"))),\"\")","v":"I"},2,null,null,"","","","","","","","",">",64,128,"R",7,null,null,"","","","","","","","",">",32,64,"R",6,null,null,"","","","","","","","",">",128,256,"R",8,null,null,"","","","","","","","",null,4,4,"R",2,null,null,"","","","","","","","",">",8,16,"R",4,null,null,"","","","","","","","",">",128,256,"R",8,null,null,"","","","","","","","",">",16,32,"R",5,null,null,"","","","","","","","",null,1,1,"I",0,null,null,"","","","","","","",""]
[null,null,null,null,null,null,null,null,null,null,null,null,null,null,null,null,null,null,null,null,null,null,null,null,null,null,null,null,null,null,null,null,null,null,null,null,null,null,null,null,null,null,null,null,null,null,null,null,null,null,null,null,null,null,null,null,null,null,null,null,null,null,null,null,null,null,null,null,null,null,null,null,null,null,null,null,null,null,null,null,null,null,null,null,null,null,null,null,null,null,null,null,null,null,null,null,null,null,null,null,null,null,null,null,null,null,null,null,null,null,null,null,null,null,null,null,null,null,null,null,null,null,null,null,null,null,null,null,null,null,null,null,null,null,null,null,null,null,null,"Note: Organisms with intrinsic resistance should not be included. See M100 Appendix B."]
[null,null,null,null,null,null,null,null,null,"Summary Data",null,null,null,null,null,null,null,null,null,null,null,null,null,null,"Summary Data",null,null,null,null,null,null,null,null,null,null,null,null,null,null,"Summary Data",null,null,null,null,null,null,null,null,null,null,null,null,null,null,"Summary Data",null,null,null,null,null,null,null,null,null,null,null,null,null,null,"Summary Data",null,null,null,null,null,null,null,null,null,null,null,null,null,null,"Summary Data",null,null,null,null,null,null,null,null,null,null,null,null,null,null,"Summary Data",null,null,null,null,null,null,null,null,null,null,null,null,null,null,"Summary Data",null,null,null,null,null,null,null,null,null,null,null,null,null,null,"Summary Data",null,null,null,null,null,null,null,null,null,null,null,null,null,null,"Summary Data"]
[null,null,null,null,null,null,null,null,null,"%","N",null,"Total N",null,null,null,null,null,null,null,null,null,null,null,"%","N",null,"Total N",null,null,null,null,null,null,null,null,null,null,null,"%","N",null,"Total N",null,null,null,null,null,null,null,null,null,null,null,"%","N",null,"Total N",null,null,null,null,null,null,null,null,null,null,null,"%","N",null,"Total N",null,null,null,null,null,null,null,null,null,null,null,"%","N",null,"Total N",null,null,null,null,null,null,null,null,null,null,null,"%","N",null,"Total N",null,null,null,null,null,null,null,null,null,null,null,"%","N",null,"Total N",null,null,null,null,null,null,null,null,null,null,null,"%","N",null,"Total N",null,null,null,null,null,null,null,null,null,null,null,"%","N",null,"Total N"]
[null,null,null,null,null,null,null,"EA",null,{"$f":"IF(M40=0,\"\",K40/M40)","v":""},{"$f":"COUNTIF(O7:O36, \"YES\")","v":0},null,{"$f":"COUNTIFS( K6:K36,\">0\")","v":0},null,null,null,null,null,null,null,null,null,"EA",null,{"$f":"IF(AB40=0,\"\",Z40/AB40)","v":""},{"$f":"COUNTIF(AD7:AD36, \"YES\")","v":0},null,{"$f":"COUNTIFS( Z6:Z36,\">0\")","v":0},null,null,null,null,null,null,null,null,null,"EA",null,{"$f":"IF(AQ40=0,\"\",AO40/AQ40)","v":""},{"$f":"COUNTIF(AS7:AS36, \"YES\")","v":0},null,{"$f":"COUNTIFS( AO6:AO36,\">0\")","v":0},null,null,null,null,null,null,null,null,null,"EA",null,{"$f":"IF(BF40=0,\"\",BD40/BF40)","v":""},{"$f":"COUNTIF(BH7:BH36, \"YES\")","v":0},null,{"$f":"COUNTIFS( BD6:BD36,\">0\")","v":0},null,null,null,null,null,null,null,null,null,"EA",null,{"$f":"IF(BU40=0,\"\",BS40/BU40)","v":""},{"$f":"COUNTIF(BW7:BW36, \"YES\")","v":0},null,{"$f":"COUNTIFS( BS6:BS36,\">0\")","v":0},null,null,null,null,null,null,null,null,null,"EA",null,{"$f":"IF(CJ40=0,\"\",CH40/CJ40)","v":""},{"$f":"COUNTIF(CL7:CL36, \"YES\")","v":0},null,{"$f":"COUNTIFS( CH6:CH36,\">0\")","v":0},null,null,null,null,null,null,null,null,null,"EA",null,{"$f":"IF(CY40=0,\"\",CW40/CY40)","v":""},{"$f":"COUNTIF(DA7:DA36, \"YES\")","v":0},null,{"$f":"COUNTIFS( CW6:CW36,\">0\")","v":0},null,null,null,null,null,null,null,null,null,"EA",null,{"$f":"IF(DN40=0,\"\",DL40/DN40)","v":""},{"$f":"COUNTIF(DP7:DP36, \"YES\")","v":0},null,{"$f":"COUNTIFS( DL6:DL36,\">0\")","v":0},null,null,null,null,null,null,null,null,null,"EA",null,{"$f":"IF(EC40=0,\"\",EA40/EC40)","v":""},{"$f":"COUNTIF(EE7:EE36, \"YES\")","v":0},null,{"$f":"COUNTIFS( EA6:EA36,\">0\")","v":0},null,null,null,null,null,null,null,null,null,"EA",null,{"$f":"IF(ER40=0,\"\",EP40/ER40)","v":""},{"$f":"COUNTIF(ET7:ET36, \"YES\")","v":0},null,{"$f":"COUNTIFS( EP6:EP36,\">0\")","v":0}]
[null,null,null,null,null,null,null,"CA",null,{"$f":"IF(M41=0,\"\",K41/M41)","v":""},{"$f":"COUNTIF(R7:R36, \"YES\")","v":0},null,{"$f":"COUNTIFS( M6:M36,\"R\")+COUNTIFS( M6:M36,\"I\")+COUNTIFS( M6:M36,\"S\")","v":0},null,null,null,null,null,null,null,null,null,"CA",null,{"$f":"IF(AB41=0,\"\",Z41/AB41)","v":""},{"$f":"COUNTIF(AG7:AG36, \"YES\")","v":0},null,{"$f":"COUNTIFS( AB6:AB36,\"R\")+COUNTIFS( AB6:AB36,\"I\")+COUNTIFS( AB6:AB36,\"S\")","v":0},null,null,null,null,null,null,null,null,null,"CA",null,{"$f":"IF(AQ41=0,\"\",AO41/AQ41)","v":""},{"$f":"COUNTIF(AV7:AV36, \"YES\")","v":0},null,{"$f":"COUNTIFS( AQ6:AQ36,\"R\")+COUNTIFS( AQ6:AQ36,\"I\")+COUNTIFS( AQ6:AQ36,\"S\")","v":0},null,null,null,null,null,null,null,null,null,"CA",null,{"$f":"IF(BF41=0,\"\",BD41/BF41)","v":""},{"$f":"COUNTIF(BK7:BK36, \"YES\")","v":0},null,{"$f":"COUNTIFS( BF6:BF36,\"R\")+COUNTIFS( BF6:BF36,\"I\")+COUNTIFS( BF6:BF36,\"S\")","v":0},null,null,null,null,null,null,null,null,null,"CA",null,{"$f":"IF(BU41=0,\"\",BS41/BU41)","v":""},{"$f":"COUNTIF(BZ7:BZ36, \"YES\")","v":0},null,{"$f":"COUNTIFS( BU6:BU36,\"R\")+COUNTIFS( BU6:BU36,\"I\")+COUNTIFS( BU6:BU36,\"S\")","v":0},null,null,null,null,null,null,null,null,null,"CA",null,{"$f":"IF(CJ41=0,\"\",CH41/CJ41)","v":""},{"$f":"COUNTIF(CO7:CO36, \"YES\")","v":0},null,{"$f":"COUNTIFS( CJ6:CJ36,\"R\")+COUNTIFS( CJ6:CJ36,\"I\")+COUNTIFS( CJ6:CJ36,\"S\")","v":0},null,null,null,null,null,null,null,null,null,"CA",null,{"$f":"IF(CY41=0,\"\",CW41/CY41)","v":""},{"$f":"COUNTIF(DD7:DD36, \"YES\")","v":0},null,{"$f":"COUNTIFS( CY6:CY36,\"R\")+COUNTIFS( CY6:CY36,\"I\")+COUNTIFS( CY6:CY36,\"S\")","v":0},null,null,null,null,null,null,null,null,null,"CA",null,{"$f":"IF(DN41=0,\"\",DL41/DN41)","v":""},{"$f":"COUNTIF(DS7:DS36, \"YES\")","v":0},null,{"$f":"COUNTIFS( DN6:DN36,\"R\")+COUNTIFS( DN6:DN36,\"I\")+COUNTIFS( DN6:DN36,\"S\")","v":0},null,null,null,null,null,null,null,null,null,"CA",null,{"$f":"IF(EC41=0,\"\",EA41/EC41)","v":""},{"$f":"COUNTIF(EH7:EH36, \"YES\")","v":0},null,{"$f":"COUNTIFS( EC6:EC36,\"R\")+COUNTIFS( EC6:EC36,\"I\")+COUNTIFS( EC6:EC36,\"S\")","v":0},null,null,null,null,null,null,null,null,null,"CA",null,{"$f":"IF(ER41=0,\"\",EP41/ER41)","v":""},{"$f":"COUNTIF(EW7:EW36, \"YES\")","v":0},null,{"$f":"COUNTIFS( ER6:ER36,\"R\")+COUNTIFS( ER6:ER36,\"I\")+COUNTIFS( ER6:ER36,\"S\")","v":0}]
[null,null,null,null,null,null,null,"minE",null,"",{"$f":"COUNTIF(S7:S36, \"minE\")","v":0},null,{"$f":"M41","v":0},null,null,null,null,null,null,null,null,null,"minE",null,"",{"$f":"COUNTIF(AH7:AH36, \"minE\")","v":0},null,{"$f":"AB41","v":0},null,null,null,null,null,null,null,null,null,"minE",null,"",{"$f":"COUNTIF(AW7:AW36, \"minE\")","v":0},null,{"$f":"AQ41","v":0},null,null,null,null,null,null,null,null,null,"minE",null,"",{"$f":"COUNTIF(BL7:BL36, \"minE\")","v":0},null,{"$f":"BF41","v":0},null,null,null,null,null,null,null,null,null,"minE",null,"",{"$f":"COUNTIF(CA7:CA36, \"minE\")","v":0},null,{"$f":"BU41","v":0},null,null,null,null,null,null,null,null,null,"minE",null,"",{"$f":"COUNTIF(CP7:CP36, \"minE\")","v":0},null,{"$f":"CJ41","v":0},null,null,null,null,null,null,null,null,null,"minE",null,"",{"$f":"COUNTIF(DE7:DE36, \"minE\")","v":0},null,{"$f":"CY41","v":0},null,null,null,null,null,null,null,null,null,"minE",null,"",{"$f":"COUNTIF(DT7:DT36, \"minE\")","v":0},null,{"$f":"DN41","v":0},null,null,null,null,null,null,null,null,null,"minE",null,"",{"$f":"COUNTIF(EI7:EI36, \"minE\")","v":0},null,{"$f":"EC41","v":0},null,null,null,null,null,null,null,null,null,"minE",null,"",{"$f":"COUNTIF(EX7:EX36, \"minE\")","v":0},null,{"$f":"ER41","v":0}]
[null,null,null,null,null,null,null,"ME",null,{"$f":"IF(M41=0, \"\",K43/M43)","v":""},{"$f":"COUNTIFS( S7:S36, \"ME\")","v":0},null,{"$f":"COUNTIFS( H6:H36,\"S\", K6:K36, \">0\")","v":0},null,null,null,null,null,null,null,null,null,"ME",null,{"$f":"IF(AB41=0, \"\",Z43/AB43)","v":""},{"$f":"COUNTIFS( AH7:AH36, \"ME\")","v":0},null,{"$f":"COUNTIFS( W6:W36,\"S\", Z6:Z36, \">0\")","v":0},null,null,null,null,null,null,null,null,null,"ME",null,{"$f":"IF(AQ41=0, \"\",AO43/AQ43)","v":""},{"$f":"COUNTIFS( AW7:AW36, \"ME\")","v":0},null,{"$f":"COUNTIFS( AL6:AL36,\"S\", AO6:AO36, \">0\")","v":0},null,null,null,null,null,null,null,null,null,"ME",null,{"$f":"IF(BF41=0, \"\",BD43/BF43)","v":""},{"$f":"COUNTIFS( BL7:BL36, \"ME\")","v":0},null,{"$f":"COUNTIFS( BA6:BA36,\"S\", BD6:BD36, \">0\")","v":0},null,null,null,null,null,null,null,null,null,"ME",null,{"$f":"IF(BU41=0, \"\",BS43/BU43)","v":""},{"$f":"COUNTIFS( CA7:CA36, \"ME\")","v":0},null,{"$f":"COUNTIFS( BP6:BP36,\"S\", BS6:BS36, \">0\")","v":0},null,null,null,null,null,null,null,null,null,"ME",null,{"$f":"IF(CJ41=0, \"\",CH43/CJ43)","v":""},{"$f":"COUNTIFS( CP7:CP36, \"ME\")","v":0},null,{"$f":"COUNTIFS( CE6:CE36,\"S\", CH6:CH36, \">0\")","v":0},null,null,null,null,null,null,null,null,null,"ME",null,{"$f":"IF(CY41=0, \"\",CW43/CY43)","v":""},{"$f":"COUNTIFS( DE7:DE36, \"ME\")","v":0},null,{"$f":"COUNTIFS( CT6:CT36,\"S\", CW6:CW36, \">0\")","v":0},null,null,null,null,null,null,null,null,null,"ME",null,{"$f":"IF(DN41=0, \"\",DL43/DN43)","v":""},{"$f":"COUNTIFS( DT7:DT36, \"ME\")","v":0},null,{"$f":"COUNTIFS( DI6:DI36,\"S\", DL6:DL36, \">0\")","v":0},null,null,null,null,null,null,null,null,null,"ME",null,{"$f":"IF(EC41=0, \"\",EA43/EC43)","v":""},{"$f":"COUNTIFS( EI7:EI36, \"ME\")","v":0},null,{"$f":"COUNTIFS( DX6:DX36,\"S\", EA6:EA36, \">0\")","v":0},null,null,null,null,null,null,null,null,null,"ME",null,{"$f":"IF(ER41=0, \"\",EP43/ER43)","v":""},{"$f":"COUNTIFS( EX7:EX36, \"ME\")","v":0},null,{"$f":"COUNTIFS( EM6:EM36,\"S\", EP6:EP36, \">0\")","v":0}]
[null,null,null,null,null,null,null,"VME",null,{"$f":"IF(M41=0,\"\",K44/M44)","v":""},{"$f":"COUNTIFS(S7:S36, \"VME\")","v":0},null,{"$f":"COUNTIFS( H6:H36,\"R\",K6:K36, \">0\")","v":0},null,null,null,null,null,null,null,null,null,"VME",null,{"$f":"IF(AB41=0,\"\",Z44/AB44)","v":""},{"$f":"COUNTIFS(AH7:AH36, \"VME\")","v":0},null,{"$f":"COUNTIFS( W6:W36,\"R\",Z6:Z36, \">0\")","v":0},null,null,null,null,null,null,null,null,null,"VME",null,{"$f":"IF(AQ41=0,\"\",AO44/AQ44)","v":""},{"$f":"COUNTIFS(AW7:AW36, \"VME\")","v":0},null,{"$f":"COUNTIFS( AL6:AL36,\"R\",AO6:AO36, \">0\")","v":0},null,null,null,null,null,null,null,null,null,"VME",null,{"$f":"IF(BF41=0,\"\",BD44/BF44)","v":""},{"$f":"COUNTIFS(BL7:BL36, \"VME\")","v":0},null,{"$f":"COUNTIFS( BA6:BA36,\"R\",BD6:BD36, \">0\")","v":0},null,null,null,null,null,null,null,null,null,"VME",null,{"$f":"IF(BU41=0,\"\",BS44/BU44)","v":""},{"$f":"COUNTIFS(CA7:CA36, \"VME\")","v":0},null,{"$f":"COUNTIFS( BP6:BP36,\"R\",BS6:BS36, \">0\")","v":0},null,null,null,null,null,null,null,null,null,"VME",null,{"$f":"IF(CJ41=0,\"\",CH44/CJ44)","v":""},{"$f":"COUNTIFS(CP7:CP36, \"VME\")","v":0},null,{"$f":"COUNTIFS( CE6:CE36,\"R\",CH6:CH36, \">0\")","v":0},null,null,null,null,null,null,null,null,null,"VME",null,{"$f":"IF(CY41=0,\"\",CW44/CY44)","v":""},{"$f":"COUNTIFS(DE7:DE36, \"VME\")","v":0},null,{"$f":"COUNTIFS( CT6:CT36,\"R\",CW6:CW36, \">0\")","v":0},null,null,null,null,null,null,null,null,null,"VME",null,{"$f":"IF(DN41=0,\"\",DL44/DN44)","v":""},{"$f":"COUNTIFS(DT7:DT36, \"VME\")","v":0},null,{"$f":"COUNTIFS( DI6:DI36,\"R\",DL6:DL36, \">0\")","v":0},null,null,null,null,null,null,null,null,null,"VME",null,{"$f":"IF(EC41=0,\"\",EA44/EC44)","v":""},{"$f":"COUNTIFS(EI7:EI36, \"VME\")","v":0},null,{"$f":"COUNTIFS( DX6:DX36,\"R\",EA6:EA36, \">0\")","v":0},null,null,null,null,null,null,null,null,null,"VME",null,{"$f":"IF(ER41=0,\"\",EP44/ER44)","v":""},{"$f":"COUNTIFS(EX7:EX36, \"VME\")","v":0},null,{"$f":"COUNTIFS( EM6:EM36,\"R\",EP6:EP36, \">0\")","v":0}]

{"sheet":"BIT-3 Precision","index":8,"n_rows":101,"n_cols":25,"rows_kept":101,"cut":false,"hidden":false,"merged":[[33,0,33,20],[23,0,23,20],[13,0,13,20],[3,0,3,20],[83,0,83,20],[73,0,73,20],[63,0,63,20],[53,0,53,20],[43,0,43,20],[34,6,34,7],[44,2,44,3],[44,4,44,5],[44,6,44,7],[54,2,54,3],[54,4,54,5],[54,6,54,7],[84,2,84,3],[84,4,84,5],[84,6,84,7],[94,2,94,3],[94,4,94,5],[94,6,94,7],[93,0,93,20],[67,17,70,20],[34,0,35,0],[34,1,35,1],[34,8,35,8],[24,0,25,0],[24,1,25,1],[24,8,25,8],[44,0,45,0],[44,1,45,1],[44,8,45,8],[47,17,50,20],[24,2,24,3],[24,4,24,5],[24,6,24,7],[34,2,34,3],[34,4,34,5],[54,8,55,8],[64,0,65,0],[64,1,65,1],[64,8,65,8],[74,0,75,0],[74,1,75,1],[74,8,75,8],[64,2,64,3],[64,4,64,5],[64,6,64,7],[74,2,74,3],[74,4,74,5],[74,6,74,7],[54,1,55,1],[97,17,100,20],[1,0,1,20],[7,17,10,20],[17,17,20,20],[27,17,30,20],[37,17,40,20],[57,17,60,20],[84,0,85,0],[84,1,85,1],[84,8,85,8],[94,0,95,0],[94,1,95,1],[94,8,95,8],[77,17,80,20],[87,17,90,20],[54,0,55,0],[4,0,5,0],[4,1,5,1],[4,8,5,8],[14,0,15,0],[14,1,15,1],[14,8,15,8],[4,2,4,3],[4,4,4,5],[4,6,4,7],[14,2,14,3],[14,4,14,5],[14,6,14,7]]}
[null,null,null,null,null,null,null,null,null,null,null,null,null,null,null,null,null,null,null,null,null,null,null,"Interp","Number"]
["Precision (Reproducibility) for BIT-3 (AR Bank Panel: FPA)",null,null,null,null,null,null,null,null,null,null,null,null,null,null,null,null,null,null,null,null,null,1,"S",1]
[null,null,null,null,null,null,null,null,null,null,null,null,null,null,null,null,null,null,null,null,null,null,2,"I",2]
["Aztreonam",null,null,null,null,null,null,null,null,null,null,null,null,null,null,null,null,null,null,null,null,null,3,"R",3]
["Isolate","Organism","Result 1",null,"Result 2",null,"Result 3",null,"Interpretation Mode or Median","Result 1","Result 2","Result 3","Mode","Result 1","Result 2","Result 3",null,null,"N","%","N Results Total",null,4,"SDD",4]
[null,null,"Intials, Date Tested","Interp","Intials, Date Tested","Interp","Intials, Date Tested","Interp",null,"Equivalency","Equivalency","Equivalency","Interp","Interp","Interp","Interp",null,"Category Equivalency",{"$f":"COUNTIF(J7:L11,\"Yes\")","v":0},{"$f":"IF(U6>0, S6/U6,\"\")","v":""},{"$f":"COUNTIF(J7:L11,\"Yes\")+COUNTIF(J7:L11,\"No\")","v":0}]
[null,null,null,null,null,null,null,null,{"$f":"IF(M7<>\"\",VLOOKUP(M7,NUM_SIR,2, FALSE),\"\")","v":""},{"$f":"IF(AND($M7<>\"\",N7<>\"\"),IF(N7=$M7, \"Yes\",\"No\"),\"\")","v":""},"","",{"$f":"IF(SUM(N7:P7)>0,IF(ISERROR(MODE(N7:P7)),MEDIAN(N7:P7),MODE(N7:P7)),\"\")","v":""},{"$f":"IF(D7<>\"\",VLOOKUP(D7,SIR_NUM,2,FALSE),\"\")","v":""},{"$f":"IF(F7<>\"\",VLOOKUP(F7,SIR_NUM,2,FALSE),\"\")","v":""},{"$f":"IF(H7<>\"\",VLOOKUP(H7,SIR_NUM,2,FALSE),\"\")","v":""},null,null,null,null,null,null,null,"Interp","Number"]
[null,null,null,null,null,null,null,null,{"$f":"IF(M8<>\"\",VLOOKUP(M8,NUM_SIR,2, FALSE),\"\")","v":""},"","","",{"$f":"IF(SUM(N8:P8)>0,IF(ISERROR(MODE(N8:P8)),MEDIAN(N8:P8),MODE(N8:P8)),\"\")","v":""},{"$f":"IF(D8<>\"\",VLOOKUP(D8,SIR_NUM,2,FALSE),\"\")","v":""},{"$f":"IF(F8<>\"\",VLOOKUP(F8,SIR_NUM,2,FALSE),\"\")","v":""},{"$f":"IF(H8<>\"\",VLOOKUP(H8,SIR_NUM,2,FALSE),\"\")","v":""},null,0,null,null,null,null,1,"S",1]
[null,null,null,null,null,null,null,null,{"$f":"IF(M9<>\"\",VLOOKUP(M9,NUM_SIR,2, FALSE),\"\")","v":""},"","","",{"$f":"IF(SUM(N9:P9)>0,IF(ISERROR(MODE(N9:P9)),MEDIAN(N9:P9),MODE(N9:P9)),\"\")","v":""},{"$f":"IF(D9<>\"\",VLOOKUP(D9,SIR_NUM,2,FALSE),\"\")","v":""},{"$f":"IF(F9<>\"\",VLOOKUP(F9,SIR_NUM,2,FALSE),\"\")","v":""},{"$f":"IF(H9<>\"\",VLOOKUP(H9,SIR_NUM,2,FALSE),\"\")","v":""},null,null,null,null,null,null,2,"SDD",2]
[null,null,null,null,null,null,null,null,{"$f":"IF(M10<>\"\",VLOOKUP(M10,NUM_SIR,2, FALSE),\"\")","v":""},"","","",{"$f":"IF(SUM(N10:P10)>0,IF(ISERROR(MODE(N10:P10)),MEDIAN(N10:P10),MODE(N10:P10)),\"\")","v":""},{"$f":"IF(D10<>\"\",VLOOKUP(D10,SIR_NUM,2,FALSE),\"\")","v":""},{"$f":"IF(F10<>\"\",VLOOKUP(F10,SIR_NUM,2,FALSE),\"\")","v":""},{"$f":"IF(H10<>\"\",VLOOKUP(H10,SIR_NUM,2,FALSE),\"\")","v":""},null,null,null,null,null,null,3,"R",3]
[null,null,null,null,null,null,null,null,{"$f":"IF(M11<>\"\",VLOOKUP(M11,NUM_SIR,2, FALSE),\"\")","v":""},"","","",{"$f":"IF(SUM(N11:P11)>0,IF(ISERROR(MODE(N11:P11)),MEDIAN(N11:P11),MODE(N11:P11)),\"\")","v":""},{"$f":"IF(D11<>\"\",VLOOKUP(D11,SIR_NUM,2,FALSE),\"\")","v":""},{"$f":"IF(F11<>\"\",VLOOKUP(F11,SIR_NUM,2,FALSE),\"\")","v":""},{"$f":"IF(H11<>\"\",VLOOKUP(H11,SIR_NUM,2,FALSE),\"\")","v":""}]
[]
[]
["Cefepime"]
["Isolate","Organism","Result 1",null,"Result 2",null,"Result 3",null,"Interpretation Mode or Median","Result 1","Result 2","Result 3","Mode","Result 1","Result 2","Result 3",null,null,"N","%","N Results Total"]
[null,null,"Intials, Date Tested","Interp","Intials, Date Tested","Interp","Intials, Date Tested","Interp",null,"Equivalency","Equivalency","Equivalency","Interp","Interp","Interp","Interp",null,"Category Equivalency",{"$f":"COUNTIF(J17:L21,\"Yes\")","v":0},{"$f":"IF(U16>0, S16/U16,\"\")","v":""},{"$f":"COUNTIF(J17:L21,\"Yes\")+COUNTIF(J17:L21,\"No\")","v":0}]
[null,null,null,null,null,null,null,null,{"$f":"IF(M17<>\"\",VLOOKUP(M17,NUM_SIR,2, FALSE),\"\")","v":""},{"$f":"IF(AND($M17<>\"\",N17<>\"\"),IF(N17=$M17, \"Yes\",\"No\"),\"\")","v":""},"","",{"$f":"IF(SUM(N17:P17)>0,IF(ISERROR(MODE(N17:P17)),MEDIAN(N17:P17),MODE(N17:P17)),\"\")","v":""},{"$f":"IF(D17<>\"\",VLOOKUP(D17,SIR_NUM,2,FALSE),\"\")","v":""},{"$f":"IF(F17<>\"\",VLOOKUP(F17,SIR_NUM,2,FALSE),\"\")","v":""},{"$f":"IF(H17<>\"\",VLOOKUP(H17,SIR_NUM,2,FALSE),\"\")","v":""}]
[null,null,null,null,null,null,null,null,{"$f":"IF(M18<>\"\",VLOOKUP(M18,NUM_SIR,2, FALSE),\"\")","v":""},"","","",{"$f":"IF(SUM(N18:P18)>0,IF(ISERROR(MODE(N18:P18)),MEDIAN(N18:P18),MODE(N18:P18)),\"\")","v":""},{"$f":"IF(D18<>\"\",VLOOKUP(D18,SIR_NUM,2,FALSE),\"\")","v":""},{"$f":"IF(F18<>\"\",VLOOKUP(F18,SIR_NUM,2,FALSE),\"\")","v":""},{"$f":"IF(H18<>\"\",VLOOKUP(H18,SIR_NUM,2,FALSE),\"\")","v":""},null,0]
[null,null,null,null,null,null,null,null,{"$f":"IF(M19<>\"\",VLOOKUP(M19,NUM_SIR,2, FALSE),\"\")","v":""},"","","",{"$f":"IF(SUM(N19:P19)>0,IF(ISERROR(MODE(N19:P19)),MEDIAN(N19:P19),MODE(N19:P19)),\"\")","v":""},{"$f":"IF(D19<>\"\",VLOOKUP(D19,SIR_NUM,2,FALSE),\"\")","v":""},{"$f":"IF(F19<>\"\",VLOOKUP(F19,SIR_NUM,2,FALSE),\"\")","v":""},{"$f":"IF(H19<>\"\",VLOOKUP(H19,SIR_NUM,2,FALSE),\"\")","v":""}]
[null,null,null,null,null,null,null,null,{"$f":"IF(M20<>\"\",VLOOKUP(M20,NUM_SIR,2, FALSE),\"\")","v":""},"","","",{"$f":"IF(SUM(N20:P20)>0,IF(ISERROR(MODE(N20:P20)),MEDIAN(N20:P20),MODE(N20:P20)),\"\")","v":""},{"$f":"IF(D20<>\"\",VLOOKUP(D20,SIR_NUM,2,FALSE),\"\")","v":""},{"$f":"IF(F20<>\"\",VLOOKUP(F20,SIR_NUM,2,FALSE),\"\")","v":""},{"$f":"IF(H20<>\"\",VLOOKUP(H20,SIR_NUM,2,FALSE),\"\")","v":""}]
[null,null,null,null,null,null,null,null,{"$f":"IF(M21<>\"\",VLOOKUP(M21,NUM_SIR,2, FALSE),\"\")","v":""},"","","",{"$f":"IF(SUM(N21:P21)>0,IF(ISERROR(MODE(N21:P21)),MEDIAN(N21:P21),MODE(N21:P21)),\"\")","v":""},{"$f":"IF(D21<>\"\",VLOOKUP(D21,SIR_NUM,2,FALSE),\"\")","v":""},{"$f":"IF(F21<>\"\",VLOOKUP(F21,SIR_NUM,2,FALSE),\"\")","v":""},{"$f":"IF(H21<>\"\",VLOOKUP(H21,SIR_NUM,2,FALSE),\"\")","v":""}]
[]
[]
["Ceftazidime"]
["Isolate","Organism","Result 1",null,"Result 2",null,"Result 3",null,"Interpretation Mode or Median","Result 1","Result 2","Result 3","Mode","Result 1","Result 2","Result 3",null,null,"N","%","N Results Total"]
[null,null,"Intials, Date Tested","Interp","Intials, Date Tested","Interp","Intials, Date Tested","Interp",null,"Equivalency","Equivalency","Equivalency","Interp","Interp","Interp","Interp",null,"Category Equivalency",{"$f":"COUNTIF(J27:L31,\"Yes\")","v":0},{"$f":"IF(U26>0, S26/U26,\"\")","v":""},{"$f":"COUNTIF(J27:L31,\"Yes\")+COUNTIF(J27:L31,\"No\")","v":0}]
[null,null,null,null,null,null,null,null,{"$f":"IF(M27<>\"\",VLOOKUP(M27,NUM_SIR,2, FALSE),\"\")","v":""},{"$f":"IF(AND($M27<>\"\",N27<>\"\"),IF(N27=$M27, \"Yes\",\"No\"),\"\")","v":""},"","",{"$f":"IF(SUM(N27:P27)>0,IF(ISERROR(MODE(N27:P27)),MEDIAN(N27:P27),MODE(N27:P27)),\"\")","v":""},{"$f":"IF(D27<>\"\",VLOOKUP(D27,SIR_NUM,2,FALSE),\"\")","v":""},{"$f":"IF(F27<>\"\",VLOOKUP(F27,SIR_NUM,2,FALSE),\"\")","v":""},{"$f":"IF(H27<>\"\",VLOOKUP(H27,SIR_NUM,2,FALSE),\"\")","v":""}]
[null,null,null,null,null,null,null,null,{"$f":"IF(M28<>\"\",VLOOKUP(M28,NUM_SIR,2, FALSE),\"\")","v":""},"","","",{"$f":"IF(SUM(N28:P28)>0,IF(ISERROR(MODE(N28:P28)),MEDIAN(N28:P28),MODE(N28:P28)),\"\")","v":""},{"$f":"IF(D28<>\"\",VLOOKUP(D28,SIR_NUM,2,FALSE),\"\")","v":""},{"$f":"IF(F28<>\"\",VLOOKUP(F28,SIR_NUM,2,FALSE),\"\")","v":""},{"$f":"IF(H28<>\"\",VLOOKUP(H28,SIR_NUM,2,FALSE),\"\")","v":""},null,0]
[null,null,null,null,null,null,null,null,{"$f":"IF(M29<>\"\",VLOOKUP(M29,NUM_SIR,2, FALSE),\"\")","v":""},"","","",{"$f":"IF(SUM(N29:P29)>0,IF(ISERROR(MODE(N29:P29)),MEDIAN(N29:P29),MODE(N29:P29)),\"\")","v":""},{"$f":"IF(D29<>\"\",VLOOKUP(D29,SIR_NUM,2,FALSE),\"\")","v":""},{"$f":"IF(F29<>\"\",VLOOKUP(F29,SIR_NUM,2,FALSE),\"\")","v":""},{"$f":"IF(H29<>\"\",VLOOKUP(H29,SIR_NUM,2,FALSE),\"\")","v":""}]
[null,null,null,null,null,null,null,null,{"$f":"IF(M30<>\"\",VLOOKUP(M30,NUM_SIR,2, FALSE),\"\")","v":""},"","","",{"$f":"IF(SUM(N30:P30)>0,IF(ISERROR(MODE(N30:P30)),MEDIAN(N30:P30),MODE(N30:P30)),\"\")","v":""},{"$f":"IF(D30<>\"\",VLOOKUP(D30,SIR_NUM,2,FALSE),\"\")","v":""},{"$f":"IF(F30<>\"\",VLOOKUP(F30,SIR_NUM,2,FALSE),\"\")","v":""},{"$f":"IF(H30<>\"\",VLOOKUP(H30,SIR_NUM,2,FALSE),\"\")","v":""}]
[null,null,null,null,null,null,null,null,{"$f":"IF(M31<>\"\",VLOOKUP(M31,NUM_SIR,2, FALSE),\"\")","v":""},"","","",{"$f":"IF(SUM(N31:P31)>0,IF(ISERROR(MODE(N31:P31)),MEDIAN(N31:P31),MODE(N31:P31)),\"\")","v":""},{"$f":"IF(D31<>\"\",VLOOKUP(D31,SIR_NUM,2,FALSE),\"\")","v":""},{"$f":"IF(F31<>\"\",VLOOKUP(F31,SIR_NUM,2,FALSE),\"\")","v":""},{"$f":"IF(H31<>\"\",VLOOKUP(H31,SIR_NUM,2,FALSE),\"\")","v":""}]
[]
[]
["Ciprofloxacin"]
["Isolate","Organism","Result 1",null,"Result 2",null,"Result 3",null,"Interpretation Mode or Median","Result 1","Result 2","Result 3","Mode","Result 1","Result 2","Result 3",null,null,"N","%","N Results Total"]
[null,null,"Intials, Date Tested","Interp","Intials, Date Tested","Interp","Intials, Date Tested","Interp",null,"Equivalency","Equivalency","Equivalency","Interp","Interp","Interp","Interp",null,"Category Equivalency",{"$f":"COUNTIF(J37:L41,\"Yes\")","v":0},{"$f":"IF(U36>0, S36/U36,\"\")","v":""},{"$f":"COUNTIF(J37:L41,\"Yes\")+COUNTIF(J37:L41,\"No\")","v":0}]
[null,null,null,null,null,null,null,null,{"$f":"IF(M37<>\"\",VLOOKUP(M37,NUM_SIR,2, FALSE),\"\")","v":""},{"$f":"IF(AND($M37<>\"\",N37<>\"\"),IF(N37=$M37, \"Yes\",\"No\"),\"\")","v":""},"","",{"$f":"IF(SUM(N37:P37)>0,IF(ISERROR(MODE(N37:P37)),MEDIAN(N37:P37),MODE(N37:P37)),\"\")","v":""},{"$f":"IF(D37<>\"\",VLOOKUP(D37,SIR_NUM,2,FALSE),\"\")","v":""},{"$f":"IF(F37<>\"\",VLOOKUP(F37,SIR_NUM,2,FALSE),\"\")","v":""},{"$f":"IF(H37<>\"\",VLOOKUP(H37,SIR_NUM,2,FALSE),\"\")","v":""}]
[null,null,null,null,null,null,null,null,{"$f":"IF(M38<>\"\",VLOOKUP(M38,NUM_SIR,2, FALSE),\"\")","v":""},"","","",{"$f":"IF(SUM(N38:P38)>0,IF(ISERROR(MODE(N38:P38)),MEDIAN(N38:P38),MODE(N38:P38)),\"\")","v":""},{"$f":"IF(D38<>\"\",VLOOKUP(D38,SIR_NUM,2,FALSE),\"\")","v":""},{"$f":"IF(F38<>\"\",VLOOKUP(F38,SIR_NUM,2,FALSE),\"\")","v":""},{"$f":"IF(H38<>\"\",VLOOKUP(H38,SIR_NUM,2,FALSE),\"\")","v":""},null,0]
[null,null,null,null,null,null,null,null,{"$f":"IF(M39<>\"\",VLOOKUP(M39,NUM_SIR,2, FALSE),\"\")","v":""},"","","",{"$f":"IF(SUM(N39:P39)>0,IF(ISERROR(MODE(N39:P39)),MEDIAN(N39:P39),MODE(N39:P39)),\"\")","v":""},{"$f":"IF(D39<>\"\",VLOOKUP(D39,SIR_NUM,2,FALSE),\"\")","v":""},{"$f":"IF(F39<>\"\",VLOOKUP(F39,SIR_NUM,2,FALSE),\"\")","v":""},{"$f":"IF(H39<>\"\",VLOOKUP(H39,SIR_NUM,2,FALSE),\"\")","v":""}]
[null,null,null,null,null,null,null,null,{"$f":"IF(M40<>\"\",VLOOKUP(M40,NUM_SIR,2, FALSE),\"\")","v":""},"","","",{"$f":"IF(SUM(N40:P40)>0,IF(ISERROR(MODE(N40:P40)),MEDIAN(N40:P40),MODE(N40:P40)),\"\")","v":""},{"$f":"IF(D40<>\"\",VLOOKUP(D40,SIR_NUM,2,FALSE),\"\")","v":""},{"$f":"IF(F40<>\"\",VLOOKUP(F40,SIR_NUM,2,FALSE),\"\")","v":""},{"$f":"IF(H40<>\"\",VLOOKUP(H40,SIR_NUM,2,FALSE),\"\")","v":""}]
[null,null,null,null,null,null,null,null,{"$f":"IF(M41<>\"\",VLOOKUP(M41,NUM_SIR,2, FALSE),\"\")","v":""},"","","",{"$f":"IF(SUM(N41:P41)>0,IF(ISERROR(MODE(N41:P41)),MEDIAN(N41:P41),MODE(N41:P41)),\"\")","v":""},{"$f":"IF(D41<>\"\",VLOOKUP(D41,SIR_NUM,2,FALSE),\"\")","v":""},{"$f":"IF(F41<>\"\",VLOOKUP(F41,SIR_NUM,2,FALSE),\"\")","v":""},{"$f":"IF(H41<>\"\",VLOOKUP(H41,SIR_NUM,2,FALSE),\"\")","v":""}]
[]
[]
["Colistin"]
["Isolate","Organism","Result 1",null,"Result 2",null,"Result 3",null,"Interpretation Mode or Median","Result 1","Result 2","Result 3","Mode","Result 1","Result 2","Result 3",null,null,"N","%","N Results Total"]
[null,null,"Intials, Date Tested","Interp","Intials, Date Tested","Interp","Intials, Date Tested","Interp",null,"Equivalency","Equivalency","Equivalency","Interp","Interp","Interp","Interp",null,"Category Equivalency",{"$f":"COUNTIF(J47:L51,\"Yes\")","v":0},{"$f":"IF(U46>0, S46/U46,\"\")","v":""},{"$f":"COUNTIF(J47:L51,\"Yes\")+COUNTIF(J47:L51,\"No\")","v":0}]
[null,null,null,null,null,null,null,null,{"$f":"IF(M47<>\"\",VLOOKUP(M47,NUM_SIR,2, FALSE),\"\")","v":""},{"$f":"IF(AND($M47<>\"\",N47<>\"\"),IF(N47=$M47, \"Yes\",\"No\"),\"\")","v":""},"","",{"$f":"IF(SUM(N47:P47)>0,IF(ISERROR(MODE(N47:P47)),MEDIAN(N47:P47),MODE(N47:P47)),\"\")","v":""},{"$f":"IF(D47<>\"\",VLOOKUP(D47,SIR_NUM,2,FALSE),\"\")","v":""},{"$f":"IF(F47<>\"\",VLOOKUP(F47,SIR_NUM,2,FALSE),\"\")","v":""},{"$f":"IF(H47<>\"\",VLOOKUP(H47,SIR_NUM,2,FALSE),\"\")","v":""}]
[null,null,null,null,null,null,null,null,{"$f":"IF(M48<>\"\",VLOOKUP(M48,NUM_SIR,2, FALSE),\"\")","v":""},"","","",{"$f":"IF(SUM(N48:P48)>0,IF(ISERROR(MODE(N48:P48)),MEDIAN(N48:P48),MODE(N48:P48)),\"\")","v":""},{"$f":"IF(D48<>\"\",VLOOKUP(D48,SIR_NUM,2,FALSE),\"\")","v":""},{"$f":"IF(F48<>\"\",VLOOKUP(F48,SIR_NUM,2,FALSE),\"\")","v":""},{"$f":"IF(H48<>\"\",VLOOKUP(H48,SIR_NUM,2,FALSE),\"\")","v":""},null,0]
[null,null,null,null,null,null,null,null,{"$f":"IF(M49<>\"\",VLOOKUP(M49,NUM_SIR,2, FALSE),\"\")","v":""},"","","",{"$f":"IF(SUM(N49:P49)>0,IF(ISERROR(MODE(N49:P49)),MEDIAN(N49:P49),MODE(N49:P49)),\"\")","v":""},{"$f":"IF(D49<>\"\",VLOOKUP(D49,SIR_NUM,2,FALSE),\"\")","v":""},{"$f":"IF(F49<>\"\",VLOOKUP(F49,SIR_NUM,2,FALSE),\"\")","v":""},{"$f":"IF(H49<>\"\",VLOOKUP(H49,SIR_NUM,2,FALSE),\"\")","v":""}]
[null,null,null,null,null,null,null,null,{"$f":"IF(M50<>\"\",VLOOKUP(M50,NUM_SIR,2, FALSE),\"\")","v":""},"","","",{"$f":"IF(SUM(N50:P50)>0,IF(ISERROR(MODE(N50:P50)),MEDIAN(N50:P50),MODE(N50:P50)),\"\")","v":""},{"$f":"IF(D50<>\"\",VLOOKUP(D50,SIR_NUM,2,FALSE),\"\")","v":""},{"$f":"IF(F50<>\"\",VLOOKUP(F50,SIR_NUM,2,FALSE),\"\")","v":""},{"$f":"IF(H50<>\"\",VLOOKUP(H50,SIR_NUM,2,FALSE),\"\")","v":""}]
[null,null,null,null,null,null,null,null,{"$f":"IF(M51<>\"\",VLOOKUP(M51,NUM_SIR,2, FALSE),\"\")","v":""},"","","",{"$f":"IF(SUM(N51:P51)>0,IF(ISERROR(MODE(N51:P51)),MEDIAN(N51:P51),MODE(N51:P51)),\"\")","v":""},{"$f":"IF(D51<>\"\",VLOOKUP(D51,SIR_NUM,2,FALSE),\"\")","v":""},{"$f":"IF(F51<>\"\",VLOOKUP(F51,SIR_NUM,2,FALSE),\"\")","v":""},{"$f":"IF(H51<>\"\",VLOOKUP(H51,SIR_NUM,2,FALSE),\"\")","v":""}]
[]
[]
["Imipenem"]
["Isolate","Organism","Result 1",null,"Result 2",null,"Result 3",null,"Interpretation Mode or Median","Result 1","Result 2","Result 3","Mode","Result 1","Result 2","Result 3",null,null,"N","%","N Results Total"]
[null,null,"Intials, Date Tested","Interp","Intials, Date Tested","Interp","Intials, Date Tested","Interp",null,"Equivalency","Equivalency","Equivalency","Interp","Interp","Interp","Interp",null,"Category Equivalency",{"$f":"COUNTIF(J57:L61,\"Yes\")","v":0},{"$f":"IF(U56>0, S56/U56,\"\")","v":""},{"$f":"COUNTIF(J57:L61,\"Yes\")+COUNTIF(J57:L61,\"No\")","v":0}]
[null,null,null,null,null,null,null,null,{"$f":"IF(M57<>\"\",VLOOKUP(M57,NUM_SIR,2, FALSE),\"\")","v":""},{"$f":"IF(AND($M57<>\"\",N57<>\"\"),IF(N57=$M57, \"Yes\",\"No\"),\"\")","v":""},"","",{"$f":"IF(SUM(N57:P57)>0,IF(ISERROR(MODE(N57:P57)),MEDIAN(N57:P57),MODE(N57:P57)),\"\")","v":""},{"$f":"IF(D57<>\"\",VLOOKUP(D57,SIR_NUM,2,FALSE),\"\")","v":""},{"$f":"IF(F57<>\"\",VLOOKUP(F57,SIR_NUM,2,FALSE),\"\")","v":""},{"$f":"IF(H57<>\"\",VLOOKUP(H57,SIR_NUM,2,FALSE),\"\")","v":""}]
[null,null,null,null,null,null,null,null,{"$f":"IF(M58<>\"\",VLOOKUP(M58,NUM_SIR,2, FALSE),\"\")","v":""},"","","",{"$f":"IF(SUM(N58:P58)>0,IF(ISERROR(MODE(N58:P58)),MEDIAN(N58:P58),MODE(N58:P58)),\"\")","v":""},{"$f":"IF(D58<>\"\",VLOOKUP(D58,SIR_NUM,2,FALSE),\"\")","v":""},{"$f":"IF(F58<>\"\",VLOOKUP(F58,SIR_NUM,2,FALSE),\"\")","v":""},{"$f":"IF(H58<>\"\",VLOOKUP(H58,SIR_NUM,2,FALSE),\"\")","v":""},null,0]
[null,null,null,null,null,null,null,null,{"$f":"IF(M59<>\"\",VLOOKUP(M59,NUM_SIR,2, FALSE),\"\")","v":""},"","","",{"$f":"IF(SUM(N59:P59)>0,IF(ISERROR(MODE(N59:P59)),MEDIAN(N59:P59),MODE(N59:P59)),\"\")","v":""},{"$f":"IF(D59<>\"\",VLOOKUP(D59,SIR_NUM,2,FALSE),\"\")","v":""},{"$f":"IF(F59<>\"\",VLOOKUP(F59,SIR_NUM,2,FALSE),\"\")","v":""},{"$f":"IF(H59<>\"\",VLOOKUP(H59,SIR_NUM,2,FALSE),\"\")","v":""}]
[null,null,null,null,null,null,null,null,{"$f":"IF(M60<>\"\",VLOOKUP(M60,NUM_SIR,2, FALSE),\"\")","v":""},"","","",{"$f":"IF(SUM(N60:P60)>0,IF(ISERROR(MODE(N60:P60)),MEDIAN(N60:P60),MODE(N60:P60)),\"\")","v":""},{"$f":"IF(D60<>\"\",VLOOKUP(D60,SIR_NUM,2,FALSE),\"\")","v":""},{"$f":"IF(F60<>\"\",VLOOKUP(F60,SIR_NUM,2,FALSE),\"\")","v":""},{"$f":"IF(H60<>\"\",VLOOKUP(H60,SIR_NUM,2,FALSE),\"\")","v":""}]
[null,null,null,null,null,null,null,null,{"$f":"IF(M61<>\"\",VLOOKUP(M61,NUM_SIR,2, FALSE),\"\")","v":""},"","","",{"$f":"IF(SUM(N61:P61)>0,IF(ISERROR(MODE(N61:P61)),MEDIAN(N61:P61),MODE(N61:P61)),\"\")","v":""},{"$f":"IF(D61<>\"\",VLOOKUP(D61,SIR_NUM,2,FALSE),\"\")","v":""},{"$f":"IF(F61<>\"\",VLOOKUP(F61,SIR_NUM,2,FALSE),\"\")","v":""},{"$f":"IF(H61<>\"\",VLOOKUP(H61,SIR_NUM,2,FALSE),\"\")","v":""}]
[]
[]
["Levofloxacin"]
["Isolate","Organism","Result 1",null,"Result 2",null,"Result 3",null,"Interpretation Mode or Median","Result 1","Result 2","Result 3","Mode","Result 1","Result 2","Result 3",null,null,"N","%","N Results Total"]
[null,null,"Intials, Date Tested","Interp","Intials, Date Tested","Interp","Intials, Date Tested","Interp",null,"Equivalency","Equivalency","Equivalency","Interp","Interp","Interp","Interp",null,"Category Equivalency",{"$f":"COUNTIF(J67:L71,\"Yes\")","v":0},{"$f":"IF(U66>0, S66/U66,\"\")","v":""},{"$f":"COUNTIF(J67:L71,\"Yes\")+COUNTIF(J67:L71,\"No\")","v":0}]
[null,null,null,null,null,null,null,null,{"$f":"IF(M67<>\"\",VLOOKUP(M67,NUM_SIR,2, FALSE),\"\")","v":""},{"$f":"IF(AND($M67<>\"\",N67<>\"\"),IF(N67=$M67, \"Yes\",\"No\"),\"\")","v":""},{"$f":"IF(AND($M67<>\"\",O67<>\"\"),IF(O67=$M67, \"Yes\",\"No\"),\"\")","v":""},{"$f":"IF(AND($M67<>\"\",P67<>\"\"),IF(P67=$M67, \"Yes\",\"No\"),\"\")","v":""},{"$f":"IF(SUM(N67:P67)>0,IF(ISERROR(MODE(N67:P67)),MEDIAN(N67:P67),MODE(N67:P67)),\"\")","v":""},{"$f":"IF(D67<>\"\",VLOOKUP(D67,SIR_NUM,2,FALSE),\"\")","v":""},{"$f":"IF(F67<>\"\",VLOOKUP(F67,SIR_NUM,2,FALSE),\"\")","v":""},{"$f":"IF(H67<>\"\",VLOOKUP(H67,SIR_NUM,2,FALSE),\"\")","v":""}]
[null,null,null,null,null,null,null,null,{"$f":"IF(M68<>\"\",VLOOKUP(M68,NUM_SIR,2, FALSE),\"\")","v":""},"","","",{"$f":"IF(SUM(N68:P68)>0,IF(ISERROR(MODE(N68:P68)),MEDIAN(N68:P68),MODE(N68:P68)),\"\")","v":""},{"$f":"IF(D68<>\"\",VLOOKUP(D68,SIR_NUM,2,FALSE),\"\")","v":""},{"$f":"IF(F68<>\"\",VLOOKUP(F68,SIR_NUM,2,FALSE),\"\")","v":""},{"$f":"IF(H68<>\"\",VLOOKUP(H68,SIR_NUM,2,FALSE),\"\")","v":""},null,0]
[null,null,null,null,null,null,null,null,{"$f":"IF(M69<>\"\",VLOOKUP(M69,NUM_SIR,2, FALSE),\"\")","v":""},"","","",{"$f":"IF(SUM(N69:P69)>0,IF(ISERROR(MODE(N69:P69)),MEDIAN(N69:P69),MODE(N69:P69)),\"\")","v":""},{"$f":"IF(D69<>\"\",VLOOKUP(D69,SIR_NUM,2,FALSE),\"\")","v":""},{"$f":"IF(F69<>\"\",VLOOKUP(F69,SIR_NUM,2,FALSE),\"\")","v":""},{"$f":"IF(H69<>\"\",VLOOKUP(H69,SIR_NUM,2,FALSE),\"\")","v":""}]
[null,null,null,null,null,null,null,null,{"$f":"IF(M70<>\"\",VLOOKUP(M70,NUM_SIR,2, FALSE),\"\")","v":""},"","","",{"$f":"IF(SUM(N70:P70)>0,IF(ISERROR(MODE(N70:P70)),MEDIAN(N70:P70),MODE(N70:P70)),\"\")","v":""},{"$f":"IF(D70<>\"\",VLOOKUP(D70,SIR_NUM,2,FALSE),\"\")","v":""},{"$f":"IF(F70<>\"\",VLOOKUP(F70,SIR_NUM,2,FALSE),\"\")","v":""},{"$f":"IF(H70<>\"\",VLOOKUP(H70,SIR_NUM,2,FALSE),\"\")","v":""}]
[null,null,null,null,null,null,null,null,{"$f":"IF(M71<>\"\",VLOOKUP(M71,NUM_SIR,2, FALSE),\"\")","v":""},"","","",{"$f":"IF(SUM(N71:P71)>0,IF(ISERROR(MODE(N71:P71)),MEDIAN(N71:P71),MODE(N71:P71)),\"\")","v":""},{"$f":"IF(D71<>\"\",VLOOKUP(D71,SIR_NUM,2,FALSE),\"\")","v":""},{"$f":"IF(F71<>\"\",VLOOKUP(F71,SIR_NUM,2,FALSE),\"\")","v":""},{"$f":"IF(H71<>\"\",VLOOKUP(H71,SIR_NUM,2,FALSE),\"\")","v":""}]
[]
[]
["Meropenem"]
["Isolate","Organism","Result 1",null,"Result 2",null,"Result 3",null,"Interpretation Mode or Median","Result 1","Result 2","Result 3","Mode","Result 1","Result 2","Result 3",null,null,"N","%","N Results Total"]
[null,null,"Intials, Date Tested","Interp","Intials, Date Tested","Interp","Intials, Date Tested","Interp",null,"Equivalency","Equivalency","Equivalency","Interp","Interp","Interp","Interp",null,"Category Equivalency",{"$f":"COUNTIF(J77:L81,\"Yes\")","v":0},{"$f":"IF(U76>0, S76/U76,\"\")","v":""},{"$f":"COUNTIF(J77:L81,\"Yes\")+COUNTIF(J77:L81,\"No\")","v":0}]
[null,null,null,null,null,null,null,null,{"$f":"IF(M77<>\"\",VLOOKUP(M77,NUM_SIR,2, FALSE),\"\")","v":""},{"$f":"IF(AND($M77<>\"\",N77<>\"\"),IF(N77=$M77, \"Yes\",\"No\"),\"\")","v":""},"","",{"$f":"IF(SUM(N77:P77)>0,IF(ISERROR(MODE(N77:P77)),MEDIAN(N77:P77),MODE(N77:P77)),\"\")","v":""},{"$f":"IF(D77<>\"\",VLOOKUP(D77,SIR_NUM,2,FALSE),\"\")","v":""},{"$f":"IF(F77<>\"\",VLOOKUP(F77,SIR_NUM,2,FALSE),\"\")","v":""},{"$f":"IF(H77<>\"\",VLOOKUP(H77,SIR_NUM,2,FALSE),\"\")","v":""}]
[null,null,null,null,null,null,null,null,{"$f":"IF(M78<>\"\",VLOOKUP(M78,NUM_SIR,2, FALSE),\"\")","v":""},"","","",{"$f":"IF(SUM(N78:P78)>0,IF(ISERROR(MODE(N78:P78)),MEDIAN(N78:P78),MODE(N78:P78)),\"\")","v":""},{"$f":"IF(D78<>\"\",VLOOKUP(D78,SIR_NUM,2,FALSE),\"\")","v":""},{"$f":"IF(F78<>\"\",VLOOKUP(F78,SIR_NUM,2,FALSE),\"\")","v":""},{"$f":"IF(H78<>\"\",VLOOKUP(H78,SIR_NUM,2,FALSE),\"\")","v":""},null,0]
[null,null,null,null,null,null,null,null,{"$f":"IF(M79<>\"\",VLOOKUP(M79,NUM_SIR,2, FALSE),\"\")","v":""},"","","",{"$f":"IF(SUM(N79:P79)>0,IF(ISERROR(MODE(N79:P79)),MEDIAN(N79:P79),MODE(N79:P79)),\"\")","v":""},{"$f":"IF(D79<>\"\",VLOOKUP(D79,SIR_NUM,2,FALSE),\"\")","v":""},{"$f":"IF(F79<>\"\",VLOOKUP(F79,SIR_NUM,2,FALSE),\"\")","v":""},{"$f":"IF(H79<>\"\",VLOOKUP(H79,SIR_NUM,2,FALSE),\"\")","v":""}]
[null,null,null,null,null,null,null,null,{"$f":"IF(M80<>\"\",VLOOKUP(M80,NUM_SIR,2, FALSE),\"\")","v":""},"","","",{"$f":"IF(SUM(N80:P80)>0,IF(ISERROR(MODE(N80:P80)),MEDIAN(N80:P80),MODE(N80:P80)),\"\")","v":""},{"$f":"IF(D80<>\"\",VLOOKUP(D80,SIR_NUM,2,FALSE),\"\")","v":""},{"$f":"IF(F80<>\"\",VLOOKUP(F80,SIR_NUM,2,FALSE),\"\")","v":""},{"$f":"IF(H80<>\"\",VLOOKUP(H80,SIR_NUM,2,FALSE),\"\")","v":""}]
[null,null,null,null,null,null,null,null,{"$f":"IF(M81<>\"\",VLOOKUP(M81,NUM_SIR,2, FALSE),\"\")","v":""},"","","",{"$f":"IF(SUM(N81:P81)>0,IF(ISERROR(MODE(N81:P81)),MEDIAN(N81:P81),MODE(N81:P81)),\"\")","v":""},{"$f":"IF(D81<>\"\",VLOOKUP(D81,SIR_NUM,2,FALSE),\"\")","v":""},{"$f":"IF(F81<>\"\",VLOOKUP(F81,SIR_NUM,2,FALSE),\"\")","v":""},{"$f":"IF(H81<>\"\",VLOOKUP(H81,SIR_NUM,2,FALSE),\"\")","v":""}]
[]
[]
["Piperacillin/tazobactam"]
["Isolate","Organism","Result 1",null,"Result 2",null,"Result 3",null,"Interpretation Mode or Median","Result 1","Result 2","Result 3","Mode","Result 1","Result 2","Result 3",null,null,"N","%","N Results Total"]
[null,null,"Intials, Date Tested","Interp","Intials, Date Tested","Interp","Intials, Date Tested","Interp",null,"Equivalency","Equivalency","Equivalency","Interp","Interp","Interp","Interp",null,"Category Equivalency",{"$f":"COUNTIF(J87:L91,\"Yes\")","v":0},{"$f":"IF(U86>0, S86/U86,\"\")","v":""},{"$f":"COUNTIF(J87:L91,\"Yes\")+COUNTIF(J87:L91,\"No\")","v":0}]
[null,null,null,null,null,null,null,null,{"$f":"IF(M87<>\"\",VLOOKUP(M87,NUM_SIR,2, FALSE),\"\")","v":""},{"$f":"IF(AND($M87<>\"\",N87<>\"\"),IF(N87=$M87, \"Yes\",\"No\"),\"\")","v":""},"","",{"$f":"IF(SUM(N87:P87)>0,IF(ISERROR(MODE(N87:P87)),MEDIAN(N87:P87),MODE(N87:P87)),\"\")","v":""},{"$f":"IF(D87<>\"\",VLOOKUP(D87,SIR_NUM,2,FALSE),\"\")","v":""},{"$f":"IF(F87<>\"\",VLOOKUP(F87,SIR_NUM,2,FALSE),\"\")","v":""},{"$f":"IF(H87<>\"\",VLOOKUP(H87,SIR_NUM,2,FALSE),\"\")","v":""}]
[null,null,null,null,null,null,null,null,{"$f":"IF(M88<>\"\",VLOOKUP(M88,NUM_SIR,2, FALSE),\"\")","v":""},"","","",{"$f":"IF(SUM(N88:P88)>0,IF(ISERROR(MODE(N88:P88)),MEDIAN(N88:P88),MODE(N88:P88)),\"\")","v":""},{"$f":"IF(D88<>\"\",VLOOKUP(D88,SIR_NUM,2,FALSE),\"\")","v":""},{"$f":"IF(F88<>\"\",VLOOKUP(F88,SIR_NUM,2,FALSE),\"\")","v":""},{"$f":"IF(H88<>\"\",VLOOKUP(H88,SIR_NUM,2,FALSE),\"\")","v":""},null,0]
[null,null,null,null,null,null,null,null,{"$f":"IF(M89<>\"\",VLOOKUP(M89,NUM_SIR,2, FALSE),\"\")","v":""},"","","",{"$f":"IF(SUM(N89:P89)>0,IF(ISERROR(MODE(N89:P89)),MEDIAN(N89:P89),MODE(N89:P89)),\"\")","v":""},{"$f":"IF(D89<>\"\",VLOOKUP(D89,SIR_NUM,2,FALSE),\"\")","v":""},{"$f":"IF(F89<>\"\",VLOOKUP(F89,SIR_NUM,2,FALSE),\"\")","v":""},{"$f":"IF(H89<>\"\",VLOOKUP(H89,SIR_NUM,2,FALSE),\"\")","v":""}]
[null,null,null,null,null,null,null,null,{"$f":"IF(M90<>\"\",VLOOKUP(M90,NUM_SIR,2, FALSE),\"\")","v":""},"","","",{"$f":"IF(SUM(N90:P90)>0,IF(ISERROR(MODE(N90:P90)),MEDIAN(N90:P90),MODE(N90:P90)),\"\")","v":""},{"$f":"IF(D90<>\"\",VLOOKUP(D90,SIR_NUM,2,FALSE),\"\")","v":""},{"$f":"IF(F90<>\"\",VLOOKUP(F90,SIR_NUM,2,FALSE),\"\")","v":""},{"$f":"IF(H90<>\"\",VLOOKUP(H90,SIR_NUM,2,FALSE),\"\")","v":""}]
[null,null,null,null,null,null,null,null,{"$f":"IF(M91<>\"\",VLOOKUP(M91,NUM_SIR,2, FALSE),\"\")","v":""},"","","",{"$f":"IF(SUM(N91:P91)>0,IF(ISERROR(MODE(N91:P91)),MEDIAN(N91:P91),MODE(N91:P91)),\"\")","v":""},{"$f":"IF(D91<>\"\",VLOOKUP(D91,SIR_NUM,2,FALSE),\"\")","v":""},{"$f":"IF(F91<>\"\",VLOOKUP(F91,SIR_NUM,2,FALSE),\"\")","v":""},{"$f":"IF(H91<>\"\",VLOOKUP(H91,SIR_NUM,2,FALSE),\"\")","v":""}]
[]
[]
["Tobramycin"]
["Isolate","Organism","Result 1",null,"Result 2",null,"Result 3",null,"Interpretation Mode or Median","Result 1","Result 2","Result 3","Mode","Result 1","Result 2","Result 3",null,null,"N","%","N Results Total"]
[null,null,"Intials, Date Tested","Interp","Intials, Date Tested","Interp","Intials, Date Tested","Interp",null,"Equivalency","Equivalency","Equivalency","Interp","Interp","Interp","Interp",null,"Category Equivalency",{"$f":"COUNTIF(J97:L101,\"Yes\")","v":0},{"$f":"IF(U96>0, S96/U96,\"\")","v":""},{"$f":"COUNTIF(J97:L101,\"Yes\")+COUNTIF(J97:L101,\"No\")","v":0}]
[null,null,null,null,null,null,null,null,{"$f":"IF(M97<>\"\",VLOOKUP(M97,NUM_SIR,2, FALSE),\"\")","v":""},{"$f":"IF(AND($M97<>\"\",N97<>\"\"),IF(N97=$M97, \"Yes\",\"No\"),\"\")","v":""},"","",{"$f":"IF(SUM(N97:P97)>0,IF(ISERROR(MODE(N97:P97)),MEDIAN(N97:P97),MODE(N97:P97)),\"\")","v":""},{"$f":"IF(D97<>\"\",VLOOKUP(D97,SIR_NUM,2,FALSE),\"\")","v":""},{"$f":"IF(F97<>\"\",VLOOKUP(F97,SIR_NUM,2,FALSE),\"\")","v":""},{"$f":"IF(H97<>\"\",VLOOKUP(H97,SIR_NUM,2,FALSE),\"\")","v":""}]
[null,null,null,null,null,null,null,null,{"$f":"IF(M98<>\"\",VLOOKUP(M98,NUM_SIR,2, FALSE),\"\")","v":""},"","","",{"$f":"IF(SUM(N98:P98)>0,IF(ISERROR(MODE(N98:P98)),MEDIAN(N98:P98),MODE(N98:P98)),\"\")","v":""},{"$f":"IF(D98<>\"\",VLOOKUP(D98,SIR_NUM,2,FALSE),\"\")","v":""},{"$f":"IF(F98<>\"\",VLOOKUP(F98,SIR_NUM,2,FALSE),\"\")","v":""},{"$f":"IF(H98<>\"\",VLOOKUP(H98,SIR_NUM,2,FALSE),\"\")","v":""},null,0]
[null,null,null,null,null,null,null,null,{"$f":"IF(M99<>\"\",VLOOKUP(M99,NUM_SIR,2, FALSE),\"\")","v":""},"","","",{"$f":"IF(SUM(N99:P99)>0,IF(ISERROR(MODE(N99:P99)),MEDIAN(N99:P99),MODE(N99:P99)),\"\")","v":""},{"$f":"IF(D99<>\"\",VLOOKUP(D99,SIR_NUM,2,FALSE),\"\")","v":""},{"$f":"IF(F99<>\"\",VLOOKUP(F99,SIR_NUM,2,FALSE),\"\")","v":""},{"$f":"IF(H99<>\"\",VLOOKUP(H99,SIR_NUM,2,FALSE),\"\")","v":""}]
[null,null,null,null,null,null,null,null,{"$f":"IF(M100<>\"\",VLOOKUP(M100,NUM_SIR,2, FALSE),\"\")","v":""},"","","",{"$f":"IF(SUM(N100:P100)>0,IF(ISERROR(MODE(N100:P100)),MEDIAN(N100:P100),MODE(N100:P100)),\"\")","v":""},{"$f":"IF(D100<>\"\",VLOOKUP(D100,SIR_NUM,2,FALSE),\"\")","v":""},{"$f":"IF(F100<>\"\",VLOOKUP(F100,SIR_NUM,2,FALSE),\"\")","v":""},{"$f":"IF(H100<>\"\",VLOOKUP(H100,SIR_NUM,2,FALSE),\"\")","v":""}]
[null,null,null,null,null,null,null,null,{"$f":"IF(M101<>\"\",VLOOKUP(M101,NUM_SIR,2, FALSE),\"\")","v":""},"","","",{"$f":"IF(SUM(N101:P101)>0,IF(ISERROR(MODE(N101:P101)),MEDIAN(N101:P101),MODE(N101:P101)),\"\")","v":""},{"$f":"IF(D101<>\"\",VLOOKUP(D101,SIR_NUM,2,FALSE),\"\")","v":""},{"$f":"IF(F101<>\"\",VLOOKUP(F101,SIR_NUM,2,FALSE),\"\")","v":""},{"$f":"IF(H101<>\"\",VLOOKUP(H101,SIR_NUM,2,FALSE),\"\")","v":""}]

{"sheet":"BIT-4","index":9,"n_rows":48,"n_cols":49,"rows_kept":48,"cut":false,"hidden":false,"merged":[[41,24,41,27],[41,9,41,12],[4,0,4,1],[0,0,0,3],[1,0,3,3],[0,4,0,18],[0,19,0,33],[4,24,4,28],[4,29,4,33],[4,2,4,3],[4,4,4,7],[4,9,4,13],[4,14,4,18],[4,19,4,22],[0,34,0,48],[4,34,4,37],[4,39,4,43],[4,44,4,48],[41,39,41,42]]}
["AR Bank Acinetobacter (ACI) Validation Set",null,null,null,"Meropenem Breakpoints 2(S)/4(I)/8(R)",null,null,null,null,null,null,null,null,null,null,null,null,null,null,"Imipenem Breakpoints 2(S)/4(I)/8(R)",null,null,null,null,null,null,null,null,null,null,null,null,null,null,"Colistin Breakpoints 2(I)/4(R)"]
["This set can be used to validate Acinetobacter baumannii for meropenem, imipenem, and colistin.",null,null,null,"N 'S'",{"$f":"COUNTIF(H$7:H$40,\"S\")","v":4},null,null,null,null,null,null,null,null,null,null,null,null,null,"N 'S'",{"$f":"COUNTIF(W$7:W$40,\"S\")","v":7},null,null,null,null,null,null,null,null,null,null,null,null,null,"N 'S'",{"$f":"COUNTIF(AL$7:AL$40,\"S\")","v":0}]
[null,null,null,null,"N 'I'",{"$f":"COUNTIF(H$7:H$40,\"I\")","v":2},null,null,null,null,null,null,null,null,null,null,null,null,null,"N 'I'",{"$f":"COUNTIF(W$7:W$40,\"I\")","v":0},null,null,null,null,null,null,null,null,null,null,null,null,null,"N 'I'",{"$f":"COUNTIF(AL$7:AL$40,\"I\")","v":28}]
[null,null,null,null,"N 'R'",{"$f":"COUNTIF(H$7:H$40,\"R\")","v":28},null,null,null,null,null,null,null,null,null,null,null,null,null,"N 'R'",{"$f":"COUNTIF(W$7:W$40,\"R\")","v":27},null,null,null,null,null,null,null,null,null,null,null,null,null,"N 'R'",{"$f":"COUNTIF(AL$7:AL$40,\"R\")","v":6}]
["Lab Information",null,"AR Bank Information",null,"Meropenem AR Bank Data",null,null,null,null," Meropenem Test Data ",null,null,null,null," Meropenem Calculations",null,null,null,null,"Imipenem AR Bank Data",null,null,null,null," Imipenem Test Data ",null,null,null,null,"Imipenem Calculations",null,null,null,null,"Colistin AR Bank Data",null,null,null,null," Colistin Test Data ",null,null,null,null,"Colistin Calculations"]
["Date Tested","Initials of Tester","AR Bank Number","Organism","Sign","MIC","Hidden MIC Result (conservative)","Interp","Hidden MIC Result Logged","Test Sign","Test  MIC","Hidden MIC Result (conservative)","Test Interp","Hidden MIC Result Logged","EA","Hidden Eval","Dilutions","CA","Error","Sign","MIC","Hidden MIC Result (conservative)","Interp","Hidden MIC Result Logged","Test Sign","Test  MIC","Hidden MIC Result (conservative)","Test Interp","Hidden MIC Result Logged","EA","Hidden Eval","Dilutions","CA","Error","Sign","MIC","Hidden MIC Result (conservative)","Interp","Hidden MIC Result Logged","Test Sign","Test  MIC","Hidden MIC Result (conservative)","Test Interp","Hidden MIC Result Logged","EA","Hidden Eval","Dilutions","CA","Error"]
[null,null,"AR0273","Acinetobacter baumannii",">",8,{"$f":"IF(AND(F7<>\"\"),IF(E7=\">\",F7*2,F7*1),\"\")","v":16},{"$f":"IF((ISNUMBER(G7)),\nIF(G7<=2,\"S\",\nIF(G7 =4,\"I\",\nIF(G7 >=8,\"R\", \"\"))),\"\")","v":"R"},{"$f":"IF(ISNUMBER(G7),ROUND(IMLOG2(G7),1),\"\")","v":4},null,null,{"$f":"IF(AND(ISNUMBER(K7)),IF(J7=\">\",K7*2,K7),\"\")","v":""},{"$f":"IF((ISNUMBER(L7)),\nIF(L7<=2,\"S\",\nIF(L7 =4,\"I\",\nIF(L7 >=8,\"R\", \"\"))),\"\")","v":""},{"$f":"IF(ISNUMBER(L7),ROUND(IMLOG2(L7),1),\"\")","v":""},{"$f":"IF(ISNUMBER(L7),IF(AND(E7=\">\",L7>=G7),\"YES\",IF(AND(OR(J7=\">\",J7=\">=\"),G7>L7),\"YES\",IF(AND(E7=\"<=\",L7<G7),\"YES\",IF(AND(J7=\"<=\",G7<L7),\"YES\",IF(ABS(N7-I7)<=1,\"YES\",\"NO\"))))),\"\")","v":""},{"$f":"IF(ISNUMBER(K7),IF(AND(E7=\"<=\",N7<=I7), \"No\", IF(AND(E7=\"<=\", J7=\"<=\"), \"No\", IF(AND(E7=\">\",N7>=I7), \"No\", IF(AND(J7=\"<=\", I7<=N7), \"No\", IF(AND(OR(J7=\">\",J7=\">=\"),I7>=N7), \"No\", \"yes\"))))),\"\")","v":""},{"$f":"IF(ISNUMBER(K7),IF(AND(J7=\"<=\",E7=\"<=\"),0,IF(AND(OR(J7=\">\",J7=\">=\"),E7=\">\"),0,IF(AND(J7=\"<=\",I7<N7),0, IF(AND(E7=\"<=\", N7<I7),0,IF(AND(OR(E7=\">\", E7=\">=\"),N7>I7),0,IF(AND(OR(J7=\">\", J7=\">=\"),I7>N7),0,IF(ISNUMBER(K7),N7-I7,\"\"))))))),\"\")","v":""},{"$f":"IF(M7<>\"\",IF(EXACT(M7,H7),\"YES\",\"NO\"),\"\")","v":""},{"$f":"IF(M7<>\"\", IF(AND(H7=\"I\",OR(M7=\"S\",M7=\"R\")),\"minE\",IF(AND(M7=\"I\",OR(H7=\"S\",H7=\"R\")),\"minE\",IF(AND(H7=\"R\",M7=\"S\"),\"VME\",IF(AND(H7=\"S\",M7=\"R\"),\"ME\",\"\")))),\"\")","v":""},null,32,{"$f":"IF(AND(U7<>\"\"),IF(T7=\">\",U7*2,U7*1),\"\")","v":32},{"$f":"IF((ISNUMBER(V7)),\nIF(V7<=2,\"S\",\nIF(V7 =4,\"I\",\nIF(V7 >=8,\"R\", \"\"))),\"\")","v":"R"},{"$f":"IF(ISNUMBER(V7),ROUND(IMLOG2(V7),1),\"\")","v":5},null,null,{"$f":"IF(AND(ISNUMBER(Z7)),IF(Y7=\">\",Z7*2,Z7),\"\")","v":""},{"$f":"IF((ISNUMBER(AA7)),\nIF(AA7<=2,\"S\",\nIF(AA7 =4,\"I\",\nIF(AA7 >=8,\"R\", \"\"))),\"\")","v":""},{"$f":"IF(ISNUMBER(AA7),ROUND(IMLOG2(AA7),1),\"\")","v":""},{"$f":"IF(ISNUMBER(AA7),IF(AND(T7=\">\",AA7>=V7),\"YES\",IF(AND(OR(Y7=\">\",Y7=\">=\"),V7>AA7),\"YES\",IF(AND(T7=\"<=\",AA7<V7),\"YES\",IF(AND(Y7=\"<=\",V7<AA7),\"YES\",IF(ABS(AC7-X7)<=1,\"YES\",\"NO\"))))),\"\")","v":""},{"$f":"IF(ISNUMBER(Z7),IF(AND(T7=\"<=\",AC7<=X7), \"No\", IF(AND(T7=\"<=\", Y7=\"<=\"), \"No\", IF(AND(T7=\">\",AC7>=X7), \"No\", IF(AND(Y7=\"<=\", X7<=AC7), \"No\", IF(AND(OR(Y7=\">\",Y7=\">=\"),X7>=AC7), \"No\", \"yes\"))))),\"\")","v":""},{"$f":"IF(ISNUMBER(Z7),IF(AND(Y7=\"<=\",T7=\"<=\"),0,IF(AND(OR(Y7=\">\",Y7=\">=\"),T7=\">\"),0,IF(AND(Y7=\"<=\",X7<AC7),0, IF(AND(T7=\"<=\", AC7<X7),0,IF(AND(OR(T7=\">\", T7=\">=\"),AC7>X7),0,IF(AND(OR(Y7=\">\", Y7=\">=\"),X7>AC7),0,IF(ISNUMBER(Z7),AC7-X7,\"\"))))))),\"\")","v":""},{"$f":"IF(AB7<>\"\",IF(EXACT(AB7,W7),\"YES\",\"NO\"),\"\")","v":""},{"$f":"IF(AB7<>\"\", IF(AND(W7=\"I\",OR(AB7=\"S\",AB7=\"R\")),\"minE\",IF(AND(AB7=\"I\",OR(W7=\"S\",W7=\"R\")),\"minE\",IF(AND(W7=\"R\",AB7=\"S\"),\"VME\",IF(AND(W7=\"S\",AB7=\"R\"),\"ME\",\"\")))),\"\")","v":""},null,1,{"$f":"IF(AND(AJ7<>\"\"),IF(AI7=\">\",AJ7*2,AJ7*1),\"\")","v":1},{"$f":"IF((ISNUMBER(AK7)),\nIF(AK7<=2,\"I\",\nIF(AK7 >=4,\"R\", \"\")),\"\")","v":"I"},{"$f":"IF(ISNUMBER(AK7),ROUND(IMLOG2(AK7),1),\"\")","v":0},null,null,{"$f":"IF(AND(ISNUMBER(AO7)),IF(AN7=\">\",AO7*2,AO7),\"\")","v":""},{"$f":"IF((ISNUMBER(AP7)),\nIF(AP7<=2,\"I\",\nIF(AP7 >=4,\"R\", \"\")),\"\")","v":""},{"$f":"IF(ISNUMBER(AP7),ROUND(IMLOG2(AP7),1),\"\")","v":""},{"$f":"IF(ISNUMBER(AP7),IF(AND(AI7=\">\",AP7>=AK7),\"YES\",IF(AND(OR(AN7=\">\",AN7=\">=\"),AK7>AP7),\"YES\",IF(AND(AI7=\"<=\",AP7<AK7),\"YES\",IF(AND(AN7=\"<=\",AK7<AP7),\"YES\",IF(ABS(AR7-AM7)<=1,\"YES\",\"NO\"))))),\"\")","v":""},{"$f":"IF(ISNUMBER(AO7),IF(AND(AI7=\"<=\",AR7<=AM7), \"No\", IF(AND(AI7=\"<=\", AN7=\"<=\"), \"No\", IF(AND(AI7=\">\",AR7>=AM7), \"No\", IF(AND(AN7=\"<=\", AM7<=AR7), \"No\", IF(AND(OR(AN7=\">\",AN7=\">=\"),AM7>=AR7), \"No\", \"yes\"))))),\"\")","v":""},{"$f":"IF(ISNUMBER(AO7),IF(AND(AN7=\"<=\",AI7=\"<=\"),0,IF(AND(OR(AN7=\">\",AN7=\">=\"),AI7=\">\"),0,IF(AND(AN7=\"<=\",AM7<AR7),0, IF(AND(AI7=\"<=\", AR7<AM7),0,IF(AND(OR(AI7=\">\", AI7=\">=\"),AR7>AM7),0,IF(AND(OR(AN7=\">\", AN7=\">=\"),AM7>AR7),0,IF(ISNUMBER(AO7),AR7-AM7,\"\"))))))),\"\")","v":""},{"$f":"IF(AQ7<>\"\",IF(EXACT(AQ7,AL7),\"YES\",\"NO\"),\"\")","v":""},{"$f":"IF(AQ7<>\"\", IF(AND(AL7=\"I\",OR(AQ7=\"S\",AQ7=\"R\")),\"minE\",IF(AND(AQ7=\"I\",OR(AL7=\"S\",AL7=\"R\")),\"minE\",IF(AND(AL7=\"R\",AQ7=\"S\"),\"VME\",IF(AND(AL7=\"S\",AQ7=\"R\"),\"ME\",\"\")))),\"\")","v":""}]
[null,null,"AR0275","Acinetobacter baumannii",">",8,16,{"$f":"IF((ISNUMBER(G8)),\nIF(G8<=2,\"S\",\nIF(G8 =4,\"I\",\nIF(G8 >=8,\"R\", \"\"))),\"\")","v":"R"},4,null,null,{"$f":"IF(AND(ISNUMBER(K8)),IF(J8=\">\",K8*2,K8),\"\")","v":""},{"$f":"IF((ISNUMBER(L8)),\nIF(L8<=2,\"S\",\nIF(L8 =4,\"I\",\nIF(L8 >=8,\"R\", \"\"))),\"\")","v":""},"",{"$f":"IF(ISNUMBER(L8),IF(AND(E8=\">\",L8>=G8),\"YES\",IF(AND(OR(J8=\">\",J8=\">=\"),G8>L8),\"YES\",IF(AND(E8=\"<=\",L8<G8),\"YES\",IF(AND(J8=\"<=\",G8<L8),\"YES\",IF(ABS(N8-I8)<=1,\"YES\",\"NO\"))))),\"\")","v":""},"","","","",null,64,64,{"$f":"IF((ISNUMBER(V8)),\nIF(V8<=2,\"S\",\nIF(V8 =4,\"I\",\nIF(V8 >=8,\"R\", \"\"))),\"\")","v":"R"},6,null,null,{"$f":"IF(AND(ISNUMBER(Z8)),IF(Y8=\">\",Z8*2,Z8),\"\")","v":""},{"$f":"IF((ISNUMBER(AA8)),\nIF(AA8<=2,\"S\",\nIF(AA8 =4,\"I\",\nIF(AA8 >=8,\"R\", \"\"))),\"\")","v":""},"",{"$f":"IF(ISNUMBER(AA8),IF(AND(T8=\">\",AA8>=V8),\"YES\",IF(AND(OR(Y8=\">\",Y8=\">=\"),V8>AA8),\"YES\",IF(AND(T8=\"<=\",AA8<V8),\"YES\",IF(AND(Y8=\"<=\",V8<AA8),\"YES\",IF(ABS(AC8-X8)<=1,\"YES\",\"NO\"))))),\"\")","v":""},{"$f":"IF(ISNUMBER(Z8),IF(AND(T8=\"<=\",AC8<=X8), \"No\", IF(AND(T8=\"<=\", Y8=\"<=\"), \"No\", IF(AND(T8=\">\",AC8>=X8), \"No\", IF(AND(Y8=\"<=\", X8<=AC8), \"No\", IF(AND(OR(Y8=\">\",Y8=\">=\"),X8>=AC8), \"No\", \"yes\"))))),\"\")","v":""},"","","",null,1,1,{"$f":"IF((ISNUMBER(AK8)),\nIF(AK8<=2,\"I\",\nIF(AK8 >=4,\"R\", \"\")),\"\")","v":"I"},0,null,null,{"$f":"IF(AND(ISNUMBER(AO8)),IF(AN8=\">\",AO8*2,AO8),\"\")","v":""},{"$f":"IF((ISNUMBER(AP8)),\nIF(AP8<=2,\"I\",\nIF(AP8 >=4,\"R\", \"\")),\"\")","v":""},"",{"$f":"IF(ISNUMBER(AP8),IF(AND(AI8=\">\",AP8>=AK8),\"YES\",IF(AND(OR(AN8=\">\",AN8=\">=\"),AK8>AP8),\"YES\",IF(AND(AI8=\"<=\",AP8<AK8),\"YES\",IF(AND(AN8=\"<=\",AK8<AP8),\"YES\",IF(ABS(AR8-AM8)<=1,\"YES\",\"NO\"))))),\"\")","v":""},"","","",""]
[null,null,"AR0276","Acinetobacter baumannii complex",null,8,8,"R",3,null,null,"","","","","","","","",null,1,1,"S",0,null,null,"","","","","","","","",null,2,2,"I",1,null,null,"","","","","","","",""]
[null,null,"AR0277","Acinetobacter baumannii",">",8,16,"R",4,null,null,"","","","","","","","",">",64,128,"R",7,null,null,"","","","","","","","",null,1,1,"I",0,null,null,"","","","","","","",""]
[null,null,"AR0278","Acinetobacter baumannii",">",8,16,"R",4,null,null,"","","","","","","","",null,64,64,"R",6,null,null,"","","","","","","","",null,1,1,"I",0,null,null,"","","","","","","",""]
[null,null,"AR0279","Acinetobacter baumannii",">",8,16,"R",4,null,null,"","","","","","","","",null,64,64,"R",6,null,null,"","","","","","","","",null,1,1,"I",0,null,null,"","","","","","","",""]
[null,null,"AR0280","Acinetobacter baumannii",null,4,4,"I",2,null,null,"","","","","","","","",null,1,1,"S",0,null,null,"","","","","","","","",null,1,1,"I",0,null,null,"","","","","","","",""]
[null,null,"AR0281","Acinetobacter baumannii",">",8,16,"R",4,null,null,"","","","","","","","",null,8,8,"R",3,null,null,"","","","","","","","",null,1,1,"I",0,null,null,"","","","","","","",""]
[null,null,"AR0283","Acinetobacter baumannii",">",8,16,"R",4,null,null,"","","","","","","","",null,64,64,"R",6,null,null,"","","","","","","","",null,1,1,"I",0,null,null,"","","","","","","",""]
[null,null,"AR0284","Acinetobacter baumannii",">",8,16,"R",4,null,null,"","","","","","","","",null,64,64,"R",6,null,null,"","","","","","","","",null,1,1,"I",0,null,null,"","","","","","","",""]
[null,null,"AR0285","Acinetobacter baumannii",">",8,16,"R",4,null,null,"","","","","","","","",">",64,128,"R",7,null,null,"","","","","","","","",null,1,1,"I",0,null,null,"","","","","","","",""]
[null,null,"AR0286","Acinetobacter baumannii",">",8,16,"R",4,null,null,"","","","","","","","",">",64,128,"R",7,null,null,"","","","","","","","",null,1,1,"I",0,null,null,"","","","","","","",""]
[null,null,"AR0287","Acinetobacter baumannii",">",8,16,"R",4,null,null,"","","","","","","","",null,64,64,"R",6,null,null,"","","","","","","","",null,1,1,"I",0,null,null,"","","","","","","",""]
[null,null,"AR0288","Acinetobacter baumannii",">",8,16,"R",4,null,null,"","","","","","","","",null,32,32,"R",5,null,null,"","","","","","","","",">",8,16,"R",4,null,null,"","","","","","","",""]
[null,null,"AR0290","Acinetobacter baumannii",">",8,16,"R",4,null,null,"","","","","","","","",null,64,64,"R",6,null,null,"","","","","","","","",null,1,1,"I",0,null,null,"","","","","","","",""]
[null,null,"AR0291","Acinetobacter baumannii",">",8,16,"R",4,null,null,"","","","","","","","",null,64,64,"R",6,null,null,"","","","","","","","",null,1,1,"I",0,null,null,"","","","","","","",""]
[null,null,"AR0295","Acinetobacter baumannii",">",8,{"$f":"IF(AND(F23<>\"\"),IF(E23=\">\",F23*2,F23*1),\"\")","v":16},"R",{"$f":"IF(ISNUMBER(G23),ROUND(IMLOG2(G23),1),\"\")","v":4},null,null,{"$f":"IF(AND(ISNUMBER(K23)),IF(J23=\">\",K23*2,K23),\"\")","v":""},"",{"$f":"IF(ISNUMBER(L23),ROUND(IMLOG2(L23),1),\"\")","v":""},{"$f":"IF(ISNUMBER(L23),IF(AND(E23=\">\",L23>=G23),\"YES\",IF(AND(OR(J23=\">\",J23=\">=\"),G23>L23),\"YES\",IF(AND(E23=\"<=\",L23<G23),\"YES\",IF(AND(J23=\"<=\",G23<L23),\"YES\",IF(ABS(N23-I23)<=1,\"YES\",\"NO\"))))),\"\")","v":""},{"$f":"IF(ISNUMBER(K23),IF(AND(E23=\"<=\",N23<=I23), \"No\", IF(AND(E23=\"<=\", J23=\"<=\"), \"No\", IF(AND(E23=\">\",N23>=I23), \"No\", IF(AND(J23=\"<=\", I23<=N23), \"No\", IF(AND(OR(J23=\">\",J23=\">=\"),I23>=N23), \"No\", \"yes\"))))),\"\")","v":""},{"$f":"IF(ISNUMBER(K23),IF(AND(J23=\"<=\",E23=\"<=\"),0,IF(AND(OR(J23=\">\",J23=\">=\"),E23=\">\"),0,IF(AND(J23=\"<=\",I23<N23),0, IF(AND(E23=\"<=\", N23<I23),0,IF(AND(OR(E23=\">\", E23=\">=\"),N23>I23),0,IF(AND(OR(J23=\">\", J23=\">=\"),I23>N23),0,IF(ISNUMBER(K23),N23-I23,\"\"))))))),\"\")","v":""},{"$f":"IF(M23<>\"\",IF(EXACT(M23,H23),\"YES\",\"NO\"),\"\")","v":""},"",">",64,{"$f":"IF(AND(U23<>\"\"),IF(T23=\">\",U23*2,U23*1),\"\")","v":128},"R",{"$f":"IF(ISNUMBER(V23),ROUND(IMLOG2(V23),1),\"\")","v":7},null,null,{"$f":"IF(AND(ISNUMBER(Z23)),IF(Y23=\">\",Z23*2,Z23),\"\")","v":""},"",{"$f":"IF(ISNUMBER(AA23),ROUND(IMLOG2(AA23),1),\"\")","v":""},{"$f":"IF(ISNUMBER(AA23),IF(AND(T23=\">\",AA23>=V23),\"YES\",IF(AND(OR(Y23=\">\",Y23=\">=\"),V23>AA23),\"YES\",IF(AND(T23=\"<=\",AA23<V23),\"YES\",IF(AND(Y23=\"<=\",V23<AA23),\"YES\",IF(ABS(AC23-X23)<=1,\"YES\",\"NO\"))))),\"\")","v":""},{"$f":"IF(ISNUMBER(Z23),IF(AND(T23=\"<=\",AC23<=X23), \"No\", IF(AND(T23=\"<=\", Y23=\"<=\"), \"No\", IF(AND(T23=\">\",AC23>=X23), \"No\", IF(AND(Y23=\"<=\", X23<=AC23), \"No\", IF(AND(OR(Y23=\">\",Y23=\">=\"),X23>=AC23), \"No\", \"yes\"))))),\"\")","v":""},"",{"$f":"IF(AB23<>\"\",IF(EXACT(AB23,W23),\"YES\",\"NO\"),\"\")","v":""},{"$f":"IF(AB23<>\"\", IF(AND(W23=\"I\",OR(AB23=\"S\",AB23=\"R\")),\"minE\",IF(AND(AB23=\"I\",OR(W23=\"S\",W23=\"R\")),\"minE\",IF(AND(W23=\"R\",AB23=\"S\"),\"VME\",IF(AND(W23=\"S\",AB23=\"R\"),\"ME\",\"\")))),\"\")","v":""},null,1,1,"I",0,null,null,"","","","","","","",""]
[null,null,"AR0296","Acinetobacter baumannii",">",8,16,"R",4,null,null,"","","","","","","","",null,64,64,"R",6,null,null,"","","","","","","","",null,0.5,0.5,"I",-1,null,null,"","","","","","","",""]
[null,null,"AR0297","Acinetobacter baumannii",">",8,16,"R",4,null,null,"","","","","","","","",null,64,64,"R",6,null,null,"","","","","","","","",null,1,1,"I",0,null,null,"","","","","","","",""]
[null,null,"AR0298","Acinetobacter baumannii",">",8,16,"R",4,null,null,"","","","","","","","",null,64,64,"R",6,null,null,"","","","","","","","",null,0.5,0.5,"I",-1,null,null,"","","","","","","",""]
[null,null,"AR0299","Acinetobacter baumannii",">",8,16,"R",4,null,null,"","","","","","","","",null,64,64,"R",6,null,null,"","","","","","","","",null,2,2,"I",1,null,null,"","","","","","","",""]
[null,null,"AR0300","Acinetobacter baumannii",null,4,4,"I",2,null,null,"","","","","","","","",null,2,2,"S",1,null,null,"","","","","","","","",null,4,4,"R",2,null,null,"","","","","","","",""]
[null,null,"AR0301","Acinetobacter baumannii",">",8,16,"R",4,null,null,"","","","","","","","",">",64,128,"R",7,null,null,"","","","","","","","",null,0.5,0.5,"I",-1,null,null,"","","","","","","",""]
[null,null,"AR0302","Acinetobacter baumannii",">",8,16,"R",4,null,null,"","","","","","","","",">",64,128,"R",7,null,null,"","","","","","","","",null,2,2,"I",1,null,null,"","","","","","","",""]
[null,null,"AR0303","Acinetobacter baumannii",">",8,16,"R",4,null,null,"","","","","","","","",null,64,64,"R",6,null,null,"","","","","","","","",">",8,16,"R",4,null,null,"","","","","","","",""]
[null,null,"AR0304","Acinetobacter baumannii",">",8,16,"R",4,null,null,"","","","","","","","",null,32,32,"R",5,null,null,"","","","","","","","",null,4,4,"R",2,null,null,"","","","","","","",""]
[null,null,"AR0306","Acinetobacter baumannii",">",8,16,"R",4,null,null,"","","","","","","","",">",64,128,"R",7,null,null,"","","","","","","","",null,1,1,"I",0,null,null,"","","","","","","",""]
[null,null,"AR0307","Acinetobacter baumannii",">",8,16,"R",4,null,null,"","","","","","","","",null,16,16,"R",4,null,null,"","","","","","","","",">",8,16,"R",4,null,null,"","","","","","","",""]
[null,null,"AR0308","Acinetobacter baumannii",">",8,16,"R",4,null,null,"","","","","","","","",null,16,16,"R",4,null,null,"","","","","","","","",null,8,8,"R",3,null,null,"","","","","","","",""]
[null,null,"AR0313","Acinetobacter baumannii",">",8,{"$f":"IF(AND(F36<>\"\"),IF(E36=\">\",F36*2,F36*1),\"\")","v":16},{"$f":"IF((ISNUMBER(G36)),\nIF(G36<=2,\"S\",\nIF(G36 =4,\"I\",\nIF(G36 >=8,\"R\", \"\"))),\"\")","v":"R"},{"$f":"IF(ISNUMBER(G36),ROUND(IMLOG2(G36),1),\"\")","v":4},null,null,{"$f":"IF(AND(ISNUMBER(K36)),IF(J36=\">\",K36*2,K36),\"\")","v":""},{"$f":"IF((ISNUMBER(L36)),\nIF(L36<=2,\"S\",\nIF(L36 =4,\"I\",\nIF(L36 >=8,\"R\", \"\"))),\"\")","v":""},{"$f":"IF(ISNUMBER(L36),ROUND(IMLOG2(L36),1),\"\")","v":""},{"$f":"IF(ISNUMBER(L36),IF(AND(E36=\">\",L36>=G36),\"YES\",IF(AND(OR(J36=\">\",J36=\">=\"),G36>L36),\"YES\",IF(AND(E36=\"<=\",L36<G36),\"YES\",IF(AND(J36=\"<=\",G36<L36),\"YES\",IF(ABS(N36-I36)<=1,\"YES\",\"NO\"))))),\"\")","v":""},{"$f":"IF(ISNUMBER(K36),IF(AND(E36=\"<=\",N36<=I36), \"No\", IF(AND(E36=\"<=\", J36=\"<=\"), \"No\", IF(AND(E36=\">\",N36>=I36), \"No\", IF(AND(J36=\"<=\", I36<=N36), \"No\", IF(AND(OR(J36=\">\",J36=\">=\"),I36>=N36), \"No\", \"yes\"))))),\"\")","v":""},{"$f":"IF(ISNUMBER(K36),IF(AND(J36=\"<=\",E36=\"<=\"),0,IF(AND(OR(J36=\">\",J36=\">=\"),E36=\">\"),0,IF(AND(J36=\"<=\",I36<N36),0, IF(AND(E36=\"<=\", N36<I36),0,IF(AND(OR(E36=\">\", E36=\">=\"),N36>I36),0,IF(AND(OR(J36=\">\", J36=\">=\"),I36>N36),0,IF(ISNUMBER(K36),N36-I36,\"\"))))))),\"\")","v":""},{"$f":"IF(M36<>\"\",IF(EXACT(M36,H36),\"YES\",\"NO\"),\"\")","v":""},{"$f":"IF(M36<>\"\", IF(AND(H36=\"I\",OR(M36=\"S\",M36=\"R\")),\"minE\",IF(AND(M36=\"I\",OR(H36=\"S\",H36=\"R\")),\"minE\",IF(AND(H36=\"R\",M36=\"S\"),\"VME\",IF(AND(H36=\"S\",M36=\"R\"),\"ME\",\"\")))),\"\")","v":""},null,32,{"$f":"IF(AND(U36<>\"\"),IF(T36=\">\",U36*2,U36*1),\"\")","v":32},{"$f":"IF((ISNUMBER(V36)),\nIF(V36<=2,\"S\",\nIF(V36 =4,\"I\",\nIF(V36 >=8,\"R\", \"\"))),\"\")","v":"R"},{"$f":"IF(ISNUMBER(V36),ROUND(IMLOG2(V36),1),\"\")","v":5},null,null,{"$f":"IF(AND(ISNUMBER(Z36)),IF(Y36=\">\",Z36*2,Z36),\"\")","v":""},{"$f":"IF((ISNUMBER(AA36)),\nIF(AA36<=2,\"S\",\nIF(AA36 =4,\"I\",\nIF(AA36 >=8,\"R\", \"\"))),\"\")","v":""},{"$f":"IF(ISNUMBER(AA36),ROUND(IMLOG2(AA36),1),\"\")","v":""},{"$f":"IF(ISNUMBER(AA36),IF(AND(T36=\">\",AA36>=V36),\"YES\",IF(AND(OR(Y36=\">\",Y36=\">=\"),V36>AA36),\"YES\",IF(AND(T36=\"<=\",AA36<V36),\"YES\",IF(AND(Y36=\"<=\",V36<AA36),\"YES\",IF(ABS(AC36-X36)<=1,\"YES\",\"NO\"))))),\"\")","v":""},{"$f":"IF(ISNUMBER(Z36),IF(AND(T36=\"<=\",AC36<=X36), \"No\", IF(AND(T36=\"<=\", Y36=\"<=\"), \"No\", IF(AND(T36=\">\",AC36>=X36), \"No\", IF(AND(Y36=\"<=\", X36<=AC36), \"No\", IF(AND(OR(Y36=\">\",Y36=\">=\"),X36>=AC36), \"No\", \"yes\"))))),\"\")","v":""},{"$f":"IF(ISNUMBER(Z36),IF(AND(Y36=\"<=\",T36=\"<=\"),0,IF(AND(OR(Y36=\">\",Y36=\">=\"),T36=\">\"),0,IF(AND(Y36=\"<=\",X36<AC36),0, IF(AND(T36=\"<=\", AC36<X36),0,IF(AND(OR(T36=\">\", T36=\">=\"),AC36>X36),0,IF(AND(OR(Y36=\">\", Y36=\">=\"),X36>AC36),0,IF(ISNUMBER(Z36),AC36-X36,\"\"))))))),\"\")","v":""},{"$f":"IF(AB36<>\"\",IF(EXACT(AB36,W36),\"YES\",\"NO\"),\"\")","v":""},{"$f":"IF(AB36<>\"\", IF(AND(W36=\"I\",OR(AB36=\"S\",AB36=\"R\")),\"minE\",IF(AND(AB36=\"I\",OR(W36=\"S\",W36=\"R\")),\"minE\",IF(AND(W36=\"R\",AB36=\"S\"),\"VME\",IF(AND(W36=\"S\",AB36=\"R\"),\"ME\",\"\")))),\"\")","v":""},null,1,1,"I",0,null,null,"","","","","","","",""]
[null,null,"AR1267","Acinetobacter baumannii complex",null,0.25,{"$f":"IF(AND(F37<>\"\"),IF(E37=\">\",F37*2,F37*1),\"\")","v":0.25},{"$f":"IF((ISNUMBER(G37)),\nIF(G37<=2,\"S\",\nIF(G37 =4,\"I\",\nIF(G37 >=8,\"R\", \"\"))),\"\")","v":"S"},{"$f":"IF(ISNUMBER(G37),ROUND(IMLOG2(G37),1),\"\")","v":-2},null,null,{"$f":"IF(AND(ISNUMBER(K37)),IF(J37=\">\",K37*2,K37),\"\")","v":""},{"$f":"IF((ISNUMBER(L37)),\nIF(L37<=2,\"S\",\nIF(L37 =4,\"I\",\nIF(L37 >=8,\"R\", \"\"))),\"\")","v":""},{"$f":"IF(ISNUMBER(L37),ROUND(IMLOG2(L37),1),\"\")","v":""},{"$f":"IF(ISNUMBER(L37),IF(AND(E37=\">\",L37>=G37),\"YES\",IF(AND(OR(J37=\">\",J37=\">=\"),G37>L37),\"YES\",IF(AND(E37=\"<=\",L37<G37),\"YES\",IF(AND(J37=\"<=\",G37<L37),\"YES\",IF(ABS(N37-I37)<=1,\"YES\",\"NO\"))))),\"\")","v":""},{"$f":"IF(ISNUMBER(K37),IF(AND(E37=\"<=\",N37<=I37), \"No\", IF(AND(E37=\"<=\", J37=\"<=\"), \"No\", IF(AND(E37=\">\",N37>=I37), \"No\", IF(AND(J37=\"<=\", I37<=N37), \"No\", IF(AND(OR(J37=\">\",J37=\">=\"),I37>=N37), \"No\", \"yes\"))))),\"\")","v":""},{"$f":"IF(ISNUMBER(K37),IF(AND(J37=\"<=\",E37=\"<=\"),0,IF(AND(OR(J37=\">\",J37=\">=\"),E37=\">\"),0,IF(AND(J37=\"<=\",I37<N37),0, IF(AND(E37=\"<=\", N37<I37),0,IF(AND(OR(E37=\">\", E37=\">=\"),N37>I37),0,IF(AND(OR(J37=\">\", J37=\">=\"),I37>N37),0,IF(ISNUMBER(K37),N37-I37,\"\"))))))),\"\")","v":""},{"$f":"IF(M37<>\"\",IF(EXACT(M37,H37),\"YES\",\"NO\"),\"\")","v":""},{"$f":"IF(M37<>\"\", IF(AND(H37=\"I\",OR(M37=\"S\",M37=\"R\")),\"minE\",IF(AND(M37=\"I\",OR(H37=\"S\",H37=\"R\")),\"minE\",IF(AND(H37=\"R\",M37=\"S\"),\"VME\",IF(AND(H37=\"S\",M37=\"R\"),\"ME\",\"\")))),\"\")","v":""},"<=",0.5,{"$f":"IF(AND(U37<>\"\"),IF(T37=\">\",U37*2,U37*1),\"\")","v":0.5},{"$f":"IF((ISNUMBER(V37)),\nIF(V37<=2,\"S\",\nIF(V37 =4,\"I\",\nIF(V37 >=8,\"R\", \"\"))),\"\")","v":"S"},{"$f":"IF(ISNUMBER(V37),ROUND(IMLOG2(V37),1),\"\")","v":-1},null,null,{"$f":"IF(AND(ISNUMBER(Z37)),IF(Y37=\">\",Z37*2,Z37),\"\")","v":""},{"$f":"IF((ISNUMBER(AA37)),\nIF(AA37<=2,\"S\",\nIF(AA37 =4,\"I\",\nIF(AA37 >=8,\"R\", \"\"))),\"\")","v":""},{"$f":"IF(ISNUMBER(AA37),ROUND(IMLOG2(AA37),1),\"\")","v":""},{"$f":"IF(ISNUMBER(AA37),IF(AND(T37=\">\",AA37>=V37),\"YES\",IF(AND(OR(Y37=\">\",Y37=\">=\"),V37>AA37),\"YES\",IF(AND(T37=\"<=\",AA37<V37),\"YES\",IF(AND(Y37=\"<=\",V37<AA37),\"YES\",IF(ABS(AC37-X37)<=1,\"YES\",\"NO\"))))),\"\")","v":""},{"$f":"IF(ISNUMBER(Z37),IF(AND(T37=\"<=\",AC37<=X37), \"No\", IF(AND(T37=\"<=\", Y37=\"<=\"), \"No\", IF(AND(T37=\">\",AC37>=X37), \"No\", IF(AND(Y37=\"<=\", X37<=AC37), \"No\", IF(AND(OR(Y37=\">\",Y37=\">=\"),X37>=AC37), \"No\", \"yes\"))))),\"\")","v":""},{"$f":"IF(ISNUMBER(Z37),IF(AND(Y37=\"<=\",T37=\"<=\"),0,IF(AND(OR(Y37=\">\",Y37=\">=\"),T37=\">\"),0,IF(AND(Y37=\"<=\",X37<AC37),0, IF(AND(T37=\"<=\", AC37<X37),0,IF(AND(OR(T37=\">\", T37=\">=\"),AC37>X37),0,IF(AND(OR(Y37=\">\", Y37=\">=\"),X37>AC37),0,IF(ISNUMBER(Z37),AC37-X37,\"\"))))))),\"\")","v":""},{"$f":"IF(AB37<>\"\",IF(EXACT(AB37,W37),\"YES\",\"NO\"),\"\")","v":""},{"$f":"IF(AB37<>\"\", IF(AND(W37=\"I\",OR(AB37=\"S\",AB37=\"R\")),\"minE\",IF(AND(AB37=\"I\",OR(W37=\"S\",W37=\"R\")),\"minE\",IF(AND(W37=\"R\",AB37=\"S\"),\"VME\",IF(AND(W37=\"S\",AB37=\"R\"),\"ME\",\"\")))),\"\")","v":""},null,1,1,"I",0,null,null,"","","","","","","",""]
[null,null,"AR1271","Acinetobacter baumannii complex",null,0.5,0.5,"S",-1,null,null,"","","","","","","","","<=",0.5,0.5,"S",-1,null,null,"","","","","","","","",null,1,1,"I",0,null,null,"","","","","","","",""]
[null,null,"AR1272","Acinetobacter baumannii",null,0.25,0.25,"S",-2,null,null,"","","","","","","","","<=",0.5,0.5,"S",-1,null,null,"","","","","","","","",null,0.5,0.5,"I",-1,null,null,"","","","","","","",""]
[null,null,"AR1273","Acinetobacter baumannii complex",null,0.25,0.25,"S",-2,null,null,"","","","","","","","","<=",0.5,0.5,"S",-1,null,null,"","","","","","","","",null,1,1,"I",0,null,null,"","","","","","","",""]
[]
[null,null,null,null,null,null,null,null,null,"Summary Data",null,null,null,null,null,null,null,null,null,null,null,null,null,null,"Summary Data",null,null,null,null,null,null,null,null,null,null,null,null,null,null,"Summary Data"]
[null,null,null,null,null,null,null,null,null,"%","N",null,"Total N",null,null,null,null,null,null,null,null,null,null,null,"%","N",null,"Total N",null,null,null,null,null,null,null,null,null,null,null,"%","N",null,"Total N"]
[null,null,null,null,null,null,null,"EA",null,{"$f":"IF(M44=0,\"\",K44/M44)","v":""},{"$f":"COUNTIF(O7:O40, \"YES\")","v":0},null,{"$f":"COUNTIFS( K6:K40,\">0\")","v":0},null,null,null,null,null,null,null,null,null,"EA",null,{"$f":"IF(AB44=0,\"\",Z44/AB44)","v":""},{"$f":"COUNTIF(AD7:AD40, \"YES\")","v":0},null,{"$f":"COUNTIFS( Z7:Z40,\">0\")","v":0},null,null,null,null,null,null,null,null,null,"EA",null,{"$f":"IF(AQ44=0,\"\",AO44/AQ44)","v":""},{"$f":"COUNTIF(AS7:AS40, \"YES\")","v":0},null,{"$f":"COUNTIFS( AO7:AP40,\">0\")","v":0}]
[null,null,null,null,null,null,null,"CA",null,{"$f":"IF(M45=0,\"\",K45/M45)","v":""},{"$f":"COUNTIF(R7:R40, \"YES\")","v":0},null,{"$f":"COUNTIFS( M6:M40,\"R\")+COUNTIFS( M6:M40,\"I\")+COUNTIFS( M6:M40,\"S\")","v":0},null,null,null,null,null,null,null,null,null,"CA",null,{"$f":"IF(AB45=0,\"\",Z45/AB45)","v":""},{"$f":"COUNTIF(AG7:AG40, \"YES\")","v":0},null,{"$f":"COUNTIFS( AB6:AB40,\"R\")+COUNTIFS( AB6:AB40,\"I\")+COUNTIFS( AB6:AB40,\"S\")","v":0},null,null,null,null,null,null,null,null,null,"CA",null,{"$f":"IF(AQ45=0,\"\",AO45/AQ45)","v":""},{"$f":"COUNTIF(AV7:AV40, \"YES\")","v":0},null,{"$f":"COUNTIFS( AQ6:AQ40,\"R\")+COUNTIFS( AQ6:AQ40,\"I\")+COUNTIFS( AQ6:AQ40,\"S\")","v":0}]
[null,null,null,null,null,null,null,"minE",null,"",{"$f":"COUNTIF(S7:S40, \"minE\")","v":0},null,{"$f":"M45","v":0},null,null,null,null,null,null,null,null,null,"minE",null,"",{"$f":"COUNTIF(AH7:AH40, \"minE\")","v":0},null,{"$f":"AB45","v":0},null,null,null,null,null,null,null,null,null,"minE",null,"",{"$f":"COUNTIF(AW7:AW40, \"minE\")","v":0},null,{"$f":"AQ45","v":0}]
[null,null,null,null,null,null,null,"ME",null,{"$f":"IF(M45=0, \"\",K47/M47)","v":""},{"$f":"COUNTIFS( S7:S40, \"ME\")","v":0},null,{"$f":"COUNTIFS( H6:H40,\"S\", K6:K40, \">0\")","v":0},null,null,null,null,null,null,null,null,null,"ME",null,{"$f":"IF(AB45=0, \"\",Z47/AB47)","v":""},{"$f":"COUNTIFS( AH7:AH40, \"ME\")","v":0},null,{"$f":"COUNTIFS( W6:W40,\"S\", Z6:Z40, \">0\")","v":0},null,null,null,null,null,null,null,null,null,"ME",null,{"$f":"IF(AQ45=0, \"\",AO47/AQ47)","v":""},{"$f":"COUNTIFS( AW7:AW40, \"ME\")","v":0},null,{"$f":"COUNTIFS( AL6:AL40,\"S\", AO6:AO40, \">0\")","v":0}]
[null,null,null,null,null,null,null,"VME",null,{"$f":"IF(M45=0,\"\",K48/M48)","v":""},{"$f":"COUNTIFS(S7:S40, \"VME\")","v":0},null,{"$f":"COUNTIFS( H6:H40,\"R\",K6:K40, \">0\")","v":0},null,null,null,null,null,null,null,null,null,"VME",null,{"$f":"IF(AB45=0,\"\",Z48/AB48)","v":""},{"$f":"COUNTIFS(AH7:AH40, \"VME\")","v":0},null,{"$f":"COUNTIFS( W6:W40,\"R\",Z6:Z40, \">0\")","v":0},null,null,null,null,null,null,null,null,null,"VME",null,{"$f":"IF(AQ45=0,\"\",AO48/AQ48)","v":""},{"$f":"COUNTIFS(AW7:AW40, \"VME\")","v":0},null,{"$f":"COUNTIFS( AL6:AL40,\"R\",AO6:AO40, \">0\")","v":0}]

{"sheet":"BIT-4 Precision","index":10,"n_rows":31,"n_cols":25,"rows_kept":31,"cut":false,"hidden":false,"merged":[[27,17,30,20],[7,17,10,20],[17,17,20,20],[1,0,1,20],[14,0,15,0],[14,1,15,1],[14,8,15,8],[4,0,5,0],[4,1,5,1],[4,8,5,8],[4,2,4,3],[4,4,4,5],[4,6,4,7],[14,2,14,3],[14,4,14,5],[14,6,14,7],[23,0,23,20],[13,0,13,20],[3,0,3,20],[24,0,25,0],[24,1,25,1],[24,8,25,8],[24,2,24,3],[24,4,24,5],[24,6,24,7]]}
[null,null,null,null,null,null,null,null,null,null,null,null,null,null,null,null,null,null,null,null,null,null,null,"Interp","Number"]
["Precision (Reproducibility) for BIT-4 (AR Bank Panel: ACI)",null,null,null,null,null,null,null,null,null,null,null,null,null,null,null,null,null,null,null,null,null,1,"S",1]
[null,null,null,null,null,null,null,null,null,null,null,null,null,null,null,null,null,null,null,null,null,null,2,"I",2]
["Imipenem",null,null,null,null,null,null,null,null,null,null,null,null,null,null,null,null,null,null,null,null,null,3,"R",3]
["Isolate","Organism","Result 1",null,"Result 2",null,"Result 3",null,"Interpretation Mode or Median","Result 1","Result 2","Result 3","Mode","Result 1","Result 2","Result 3",null,null,"N","%","N Results Total",null,4,"SDD",4]
[null,null,"Intials, Date Tested","Interp","Intials, Date Tested","Interp","Intials, Date Tested","Interp",null,"Equivalency","Equivalency","Equivalency","Interp","Interp","Interp","Interp",null,"Category Equivalency",{"$f":"COUNTIF(J7:L11,\"Yes\")","v":0},{"$f":"IF(U6>0, S6/U6,\"\")","v":""},{"$f":"COUNTIF(J7:L11,\"Yes\")+COUNTIF(J7:L11,\"No\")","v":0}]
[null,null,null,null,null,null,null,null,{"$f":"IF(M7<>\"\",VLOOKUP(M7,NUM_SIR,2, FALSE),\"\")","v":""},{"$f":"IF(AND($M7<>\"\",N7<>\"\"),IF(N7=$M7, \"Yes\",\"No\"),\"\")","v":""},"","",{"$f":"IF(SUM(N7:P7)>0,IF(ISERROR(MODE(N7:P7)),MEDIAN(N7:P7),MODE(N7:P7)),\"\")","v":""},{"$f":"IF(D7<>\"\",VLOOKUP(D7,SIR_NUM,2,FALSE),\"\")","v":""},{"$f":"IF(F7<>\"\",VLOOKUP(F7,SIR_NUM,2,FALSE),\"\")","v":""},{"$f":"IF(H7<>\"\",VLOOKUP(H7,SIR_NUM,2,FALSE),\"\")","v":""},null,null,null,null,null,null,null,"Interp","Number"]
[null,null,null,null,null,null,null,null,{"$f":"IF(M8<>\"\",VLOOKUP(M8,NUM_SIR,2, FALSE),\"\")","v":""},"","","",{"$f":"IF(SUM(N8:P8)>0,IF(ISERROR(MODE(N8:P8)),MEDIAN(N8:P8),MODE(N8:P8)),\"\")","v":""},{"$f":"IF(D8<>\"\",VLOOKUP(D8,SIR_NUM,2,FALSE),\"\")","v":""},{"$f":"IF(F8<>\"\",VLOOKUP(F8,SIR_NUM,2,FALSE),\"\")","v":""},{"$f":"IF(H8<>\"\",VLOOKUP(H8,SIR_NUM,2,FALSE),\"\")","v":""},null,0,null,null,null,null,1,"S",1]
[null,null,null,null,null,null,null,null,{"$f":"IF(M9<>\"\",VLOOKUP(M9,NUM_SIR,2, FALSE),\"\")","v":""},"","","",{"$f":"IF(SUM(N9:P9)>0,IF(ISERROR(MODE(N9:P9)),MEDIAN(N9:P9),MODE(N9:P9)),\"\")","v":""},{"$f":"IF(D9<>\"\",VLOOKUP(D9,SIR_NUM,2,FALSE),\"\")","v":""},{"$f":"IF(F9<>\"\",VLOOKUP(F9,SIR_NUM,2,FALSE),\"\")","v":""},{"$f":"IF(H9<>\"\",VLOOKUP(H9,SIR_NUM,2,FALSE),\"\")","v":""},null,null,null,null,null,null,2,"SDD",2]
[null,null,null,null,null,null,null,null,{"$f":"IF(M10<>\"\",VLOOKUP(M10,NUM_SIR,2, FALSE),\"\")","v":""},"","","",{"$f":"IF(SUM(N10:P10)>0,IF(ISERROR(MODE(N10:P10)),MEDIAN(N10:P10),MODE(N10:P10)),\"\")","v":""},{"$f":"IF(D10<>\"\",VLOOKUP(D10,SIR_NUM,2,FALSE),\"\")","v":""},{"$f":"IF(F10<>\"\",VLOOKUP(F10,SIR_NUM,2,FALSE),\"\")","v":""},{"$f":"IF(H10<>\"\",VLOOKUP(H10,SIR_NUM,2,FALSE),\"\")","v":""},null,null,null,null,null,null,3,"R",3]
[null,null,null,null,null,null,null,null,{"$f":"IF(M11<>\"\",VLOOKUP(M11,NUM_SIR,2, FALSE),\"\")","v":""},"","","",{"$f":"IF(SUM(N11:P11)>0,IF(ISERROR(MODE(N11:P11)),MEDIAN(N11:P11),MODE(N11:P11)),\"\")","v":""},{"$f":"IF(D11<>\"\",VLOOKUP(D11,SIR_NUM,2,FALSE),\"\")","v":""},{"$f":"IF(F11<>\"\",VLOOKUP(F11,SIR_NUM,2,FALSE),\"\")","v":""},{"$f":"IF(H11<>\"\",VLOOKUP(H11,SIR_NUM,2,FALSE),\"\")","v":""}]
[]
[]
["Meropenem"]
["Isolate","Organism","Result 1",null,"Result 2",null,"Result 3",null,"Interpretation Mode or Median","Result 1","Result 2","Result 3","Mode","Result 1","Result 2","Result 3",null,null,"N","%","N Results Total"]
[null,null,"Intials, Date Tested","Interp","Intials, Date Tested","Interp","Intials, Date Tested","Interp",null,"Equivalency","Equivalency","Equivalency","Interp","Interp","Interp","Interp",null,"Category Equivalency",{"$f":"COUNTIF(J17:L21,\"Yes\")","v":0},{"$f":"IF(U16>0, S16/U16,\"\")","v":""},{"$f":"COUNTIF(J17:L21,\"Yes\")+COUNTIF(J17:L21,\"No\")","v":0}]
[null,null,null,null,null,null,null,null,{"$f":"IF(M17<>\"\",VLOOKUP(M17,NUM_SIR,2, FALSE),\"\")","v":""},{"$f":"IF(AND($M17<>\"\",N17<>\"\"),IF(N17=$M17, \"Yes\",\"No\"),\"\")","v":""},"","",{"$f":"IF(SUM(N17:P17)>0,IF(ISERROR(MODE(N17:P17)),MEDIAN(N17:P17),MODE(N17:P17)),\"\")","v":""},{"$f":"IF(D17<>\"\",VLOOKUP(D17,SIR_NUM,2,FALSE),\"\")","v":""},{"$f":"IF(F17<>\"\",VLOOKUP(F17,SIR_NUM,2,FALSE),\"\")","v":""},{"$f":"IF(H17<>\"\",VLOOKUP(H17,SIR_NUM,2,FALSE),\"\")","v":""}]
[null,null,null,null,null,null,null,null,{"$f":"IF(M18<>\"\",VLOOKUP(M18,NUM_SIR,2, FALSE),\"\")","v":""},"","","",{"$f":"IF(SUM(N18:P18)>0,IF(ISERROR(MODE(N18:P18)),MEDIAN(N18:P18),MODE(N18:P18)),\"\")","v":""},{"$f":"IF(D18<>\"\",VLOOKUP(D18,SIR_NUM,2,FALSE),\"\")","v":""},{"$f":"IF(F18<>\"\",VLOOKUP(F18,SIR_NUM,2,FALSE),\"\")","v":""},{"$f":"IF(H18<>\"\",VLOOKUP(H18,SIR_NUM,2,FALSE),\"\")","v":""},null,0]
[null,null,null,null,null,null,null,null,{"$f":"IF(M19<>\"\",VLOOKUP(M19,NUM_SIR,2, FALSE),\"\")","v":""},"","","",{"$f":"IF(SUM(N19:P19)>0,IF(ISERROR(MODE(N19:P19)),MEDIAN(N19:P19),MODE(N19:P19)),\"\")","v":""},{"$f":"IF(D19<>\"\",VLOOKUP(D19,SIR_NUM,2,FALSE),\"\")","v":""},{"$f":"IF(F19<>\"\",VLOOKUP(F19,SIR_NUM,2,FALSE),\"\")","v":""},{"$f":"IF(H19<>\"\",VLOOKUP(H19,SIR_NUM,2,FALSE),\"\")","v":""}]
[null,null,null,null,null,null,null,null,{"$f":"IF(M20<>\"\",VLOOKUP(M20,NUM_SIR,2, FALSE),\"\")","v":""},"","","",{"$f":"IF(SUM(N20:P20)>0,IF(ISERROR(MODE(N20:P20)),MEDIAN(N20:P20),MODE(N20:P20)),\"\")","v":""},{"$f":"IF(D20<>\"\",VLOOKUP(D20,SIR_NUM,2,FALSE),\"\")","v":""},{"$f":"IF(F20<>\"\",VLOOKUP(F20,SIR_NUM,2,FALSE),\"\")","v":""},{"$f":"IF(H20<>\"\",VLOOKUP(H20,SIR_NUM,2,FALSE),\"\")","v":""}]
[null,null,null,null,null,null,null,null,{"$f":"IF(M21<>\"\",VLOOKUP(M21,NUM_SIR,2, FALSE),\"\")","v":""},"","","",{"$f":"IF(SUM(N21:P21)>0,IF(ISERROR(MODE(N21:P21)),MEDIAN(N21:P21),MODE(N21:P21)),\"\")","v":""},{"$f":"IF(D21<>\"\",VLOOKUP(D21,SIR_NUM,2,FALSE),\"\")","v":""},{"$f":"IF(F21<>\"\",VLOOKUP(F21,SIR_NUM,2,FALSE),\"\")","v":""},{"$f":"IF(H21<>\"\",VLOOKUP(H21,SIR_NUM,2,FALSE),\"\")","v":""}]
[]
[]
["Colistin"]
["Isolate","Organism","Result 1",null,"Result 2",null,"Result 3",null,"Interpretation Mode or Median","Result 1","Result 2","Result 3","Mode","Result 1","Result 2","Result 3",null,null,"N","%","N Results Total"]
[null,null,"Intials, Date Tested","Interp","Intials, Date Tested","Interp","Intials, Date Tested","Interp",null,"Equivalency","Equivalency","Equivalency","Interp","Interp","Interp","Interp",null,"Category Equivalency",{"$f":"COUNTIF(J27:L31,\"Yes\")","v":0},{"$f":"IF(U26>0, S26/U26,\"\")","v":""},{"$f":"COUNTIF(J27:L31,\"Yes\")+COUNTIF(J27:L31,\"No\")","v":0}]
[null,null,null,null,null,null,null,null,{"$f":"IF(M27<>\"\",VLOOKUP(M27,NUM_SIR,2, FALSE),\"\")","v":""},{"$f":"IF(AND($M27<>\"\",N27<>\"\"),IF(N27=$M27, \"Yes\",\"No\"),\"\")","v":""},{"$f":"IF(AND($M27<>\"\",O27<>\"\"),IF(O27=$M27, \"Yes\",\"No\"),\"\")","v":""},{"$f":"IF(AND($M27<>\"\",P27<>\"\"),IF(P27=$M27, \"Yes\",\"No\"),\"\")","v":""},{"$f":"IF(SUM(N27:P27)>0,IF(ISERROR(MODE(N27:P27)),MEDIAN(N27:P27),MODE(N27:P27)),\"\")","v":""},{"$f":"IF(D27<>\"\",VLOOKUP(D27,SIR_NUM,2,FALSE),\"\")","v":""},{"$f":"IF(F27<>\"\",VLOOKUP(F27,SIR_NUM,2,FALSE),\"\")","v":""},{"$f":"IF(H27<>\"\",VLOOKUP(H27,SIR_NUM,2,FALSE),\"\")","v":""}]
[null,null,null,null,null,null,null,null,{"$f":"IF(M28<>\"\",VLOOKUP(M28,NUM_SIR,2, FALSE),\"\")","v":""},"","","",{"$f":"IF(SUM(N28:P28)>0,IF(ISERROR(MODE(N28:P28)),MEDIAN(N28:P28),MODE(N28:P28)),\"\")","v":""},{"$f":"IF(D28<>\"\",VLOOKUP(D28,SIR_NUM,2,FALSE),\"\")","v":""},{"$f":"IF(F28<>\"\",VLOOKUP(F28,SIR_NUM,2,FALSE),\"\")","v":""},{"$f":"IF(H28<>\"\",VLOOKUP(H28,SIR_NUM,2,FALSE),\"\")","v":""},null,0]
[null,null,null,null,null,null,null,null,{"$f":"IF(M29<>\"\",VLOOKUP(M29,NUM_SIR,2, FALSE),\"\")","v":""},"","","",{"$f":"IF(SUM(N29:P29)>0,IF(ISERROR(MODE(N29:P29)),MEDIAN(N29:P29),MODE(N29:P29)),\"\")","v":""},{"$f":"IF(D29<>\"\",VLOOKUP(D29,SIR_NUM,2,FALSE),\"\")","v":""},{"$f":"IF(F29<>\"\",VLOOKUP(F29,SIR_NUM,2,FALSE),\"\")","v":""},{"$f":"IF(H29<>\"\",VLOOKUP(H29,SIR_NUM,2,FALSE),\"\")","v":""}]
[null,null,null,null,null,null,null,null,{"$f":"IF(M30<>\"\",VLOOKUP(M30,NUM_SIR,2, FALSE),\"\")","v":""},"","","",{"$f":"IF(SUM(N30:P30)>0,IF(ISERROR(MODE(N30:P30)),MEDIAN(N30:P30),MODE(N30:P30)),\"\")","v":""},{"$f":"IF(D30<>\"\",VLOOKUP(D30,SIR_NUM,2,FALSE),\"\")","v":""},{"$f":"IF(F30<>\"\",VLOOKUP(F30,SIR_NUM,2,FALSE),\"\")","v":""},{"$f":"IF(H30<>\"\",VLOOKUP(H30,SIR_NUM,2,FALSE),\"\")","v":""}]
[null,null,null,null,null,null,null,null,{"$f":"IF(M31<>\"\",VLOOKUP(M31,NUM_SIR,2, FALSE),\"\")","v":""},"","","",{"$f":"IF(SUM(N31:P31)>0,IF(ISERROR(MODE(N31:P31)),MEDIAN(N31:P31),MODE(N31:P31)),\"\")","v":""},{"$f":"IF(D31<>\"\",VLOOKUP(D31,SIR_NUM,2,FALSE),\"\")","v":""},{"$f":"IF(F31<>\"\",VLOOKUP(F31,SIR_NUM,2,FALSE),\"\")","v":""},{"$f":"IF(H31<>\"\",VLOOKUP(H31,SIR_NUM,2,FALSE),\"\")","v":""}]

{"sheet":"list","index":11,"n_rows":21,"n_cols":2,"rows_kept":21,"cut":false,"hidden":true,"merged":[]}
["MIC","Rounded"]
[1024,{"$f":"ROUND(A2,3)","v":1024}]
[{"$f":"A2/2","v":512},{"$f":"ROUND(A3,3)","v":512}]
[{"$f":"A3/2","v":256},256]
[128,128]
[64,64]
[32,32]
[16,16]
[8,8]
[4,4]
[2,2]
[1,1]
[0.5,0.5]
[0.25,0.25]
[0.125,0.125]
[6.25E-2,6.3E-2]
[3.125E-2,3.1E-2]
[1.5625E-2,1.6E-2]
[7.8125E-3,8.0000000000000002E-3]
[3.90625E-3,4.0000000000000001E-3]
[1.953125E-3,2E-3]